program: Orca
programVersion: 5.0.2
elementType: O O O C C C C C C C C C C C C C C C C C C C C C C H H H H H H H H H H H H H H H H H H H H H H H H H H
charge: 0
multiplicity: 1
keywords: wb97x-d3
keywords: def2-TZVPP
keywords: def2/J RIJCOSX
keywords: DEFGRID2
keywords: scfconv7
keywords: smallprint printgap noloewdin
keywords: NOSOSCF
formula: C22H26O3
InChI: InChI=1/C22H26O3/c1-15(2)10-19-20(22(19,3)4)21(23)25-14-17-12-18(24-13-17)11-16-8-6-5-7-9-16/h5-10,12-13,19-20H,11,14H2,1-4H3
51 atoms
O  1.434011 -1.728558 -1.075651
O  2.318357 -2.131864 0.93702
O  -1.891617 -2.947808 1.451706
C  1.561922 1.199667 0.07719
C  2.437647 0.990822 -1.125119
C  2.541616 0.035237 0.036478
C  1.89724 2.306627 1.045151
C  0.076767 0.965775 -0.061235
C  3.594051 1.871478 -1.422696
C  2.096302 -1.371062 0.019349
C  3.633383 2.800355 -2.382552
C  4.865747 3.619968 -2.617969
C  2.484474 3.107403 -3.293072
C  0.760787 -3.00378 -1.06923
C  -0.483332 -2.910972 -0.262776
C  -1.693064 -2.242649 -0.637685
C  -0.667103 -3.318237 1.014851
C  -2.510354 -2.285859 0.439054
C  -3.825838 -1.651841 0.724494
C  -3.628838 -0.207498 1.123056
C  -3.191505 0.12398 2.403325
C  -3.810574 0.810677 0.192072
C  -2.933528 1.445236 2.74163
C  -3.559134 2.13422 0.529825
C  -3.114978 2.455256 1.805039
H  1.909123 0.611045 -1.993474
H  3.403804 0.169352 0.681735
H  1.449871 2.11027 2.021355
H  1.500175 3.258209 0.685812
H  2.970224 2.427969 1.190267
H  -0.418509 1.910562 -0.29416
H  -0.354098 0.591241 0.870346
H  -0.175399 0.267444 -0.856061
H  4.475899 1.739875 -0.801916
H  5.224793 3.501459 -3.643513
H  4.659808 4.685133 -2.485474
H  5.676981 3.345785 -1.943832
H  2.234487 4.170127 -3.24499
H  2.746961 2.901774 -4.334064
H  1.582732 2.545141 -3.057227
H  1.423884 -3.790724 -0.71019
H  0.539665 -3.200018 -2.116439
H  -1.909952 -1.770715 -1.583557
H  -0.048303 -3.865419 1.708478
H  -4.344269 -2.201633 1.512523
H  -4.4481 -1.707895 -0.169363
H  -3.048588 -0.656223 3.141854
H  -4.149798 0.565944 -0.807626
H  -2.592198 1.687111 3.740002
H  -3.707628 2.913912 -0.206162
H  -2.915811 3.485567 2.069504
elementType: O C H
totalener: -1079.73736884 hartree
nucrepener: 2188.49900323 hartree
electener: -3268.23637207 hartree
oneelecener: -5816.33414386 hartree
twoeener: 2548.09777179 hartree
cpcmener: -0.03104033 hartree
kineticenergy: 1074.85656975 hartree
xcener: -106.462120636650 hartree
chargesum: 0.0000000
charge: -0.280064 -0.498999 -0.281289 0.210931 0.027626 -0.157609 -0.274256 -0.359401 -0.298196 0.426192 -0.028141 -0.229947 -0.254164 0.074510 -0.046997 -0.407542 -0.023131 0.247677 -0.041262 0.011882 -0.188563 -0.165316 -0.162842 -0.177589 -0.163968 0.103982 0.094480 0.097924 0.095383 0.092994 0.104422 0.100773 0.104211 0.122091 0.094459 0.094938 0.089513 0.095985 0.099377 0.088092 0.120650 0.120394 0.166137 0.176272 0.111155 0.107532 0.140926 0.140212 0.159065 0.159299 0.160188
qa: -0.2801 -0.4990 -0.2813 0.2109 0.0276 -0.1576 -0.2743 -0.3594 -0.2982 0.4262 -0.0281 -0.2299 -0.2542 0.0745 -0.0470 -0.4075 -0.0231 0.2477 -0.0413 0.0119 -0.1886 -0.1653 -0.1628 -0.1776 -0.1640 0.1040 0.0945 0.0979 0.0954 0.0930 0.1044 0.1008 0.1042 0.1221 0.0945 0.0949 0.0895 0.0960 0.0994 0.0881 0.1206 0.1204 0.1661 0.1763 0.1112 0.1075 0.1409 0.1402 0.1591 0.1593 0.1602
va: 2.1153 1.9939 2.2675 3.6322 3.7509 3.9139 3.9004 3.9209 3.8634 4.1665 3.7054 3.9266 3.9441 3.8337 3.6171 3.9605 3.9643 3.5552 3.8086 3.6259 3.9116 3.8725 3.8907 3.8660 3.8553 1.0176 1.0351 1.0026 1.0030 1.0032 0.9988 0.9943 1.0077 1.0079 0.9952 0.9961 1.0078 0.9976 0.9973 1.0080 1.0090 0.9953 1.0069 1.0010 1.0146 1.0104 1.0107 1.0036 0.9905 0.9910 0.9897
dispcorr: -0.027154340 hartree
energy: -1079.764523179831
dipole: 10.99865 -11.81393 -0.81527 24.03858 -22.99131 1.04727 -10.06814 8.74473 -1.32341
magnitude: 1.87426 au
magnitude: 4.76399 debye
