program: Gaussian 09
title: 000069555
version: EM64L-G09RevD.01
frameworkgroup: C1[X(C8H5F5O)]
method: RPBEPBE
basis: SDD
operation: Freq
keyword: #pfreq=noraman
keyword: PBEPBE/SDD
title: #p freq=noraman PBEPBE/SDD
converged: YES YES NO NO
title: Mulliken charges:
elementType: F F F F F O C C C C C C C C H H H H H
charge: -0.165567 -0.150757 -0.148603 -0.149448 -0.146929 -0.457126 0.290033 -0.503882 0.120482 0.114138 -0.311526 0.061958 0.063917 0.111981 0.259239 0.231186 0.207456 0.218408 0.355041
chargesum: 0.00000
title: Mulliken charges with hydrogens summed into heavy atoms:
elementType: F F F F F O C C C C C C C C
charge: -0.165567 -0.150757 -0.148603 -0.149448 -0.146929 -0.102085 0.290033 -0.013457 0.120482 0.114138 0.114337 0.061958 0.063917 0.111981
polarizability: 1.14223564e+02 -2.46081206e+00 9.89754728e+01 8.39913310e+00 -2.42636847e-01 5.52510960e+01
1716.lowfreq: -9.3282 -4.3299 -0.0004 0.0007 0.0008 8.2317 37.6778 59.4734 105.7059
frequency: 37.5715 59.4527 105.6998 122.4176 148.1337 174.7127 213.7276 245.5197 254.4158 257.8822 284.5339 290.6768 306.5177 358.9731 372.7199 409.3451 427.0323 469.7667 530.4392 565.4011 629.9958 637.4615 702.3075 737.5980 847.2632 872.1441 904.3658 966.4222 1020.4991 1054.6647 1070.3065 1086.4550 1173.2103 1197.3223 1229.2485 1265.5092 1339.9906 1373.8733 1391.4706 1403.0398 1449.5581 1458.0202 1467.5755 1482.1597 1608.6522 1627.2956 2956.5214 3011.1316 3027.9047 3098.4467 3582.5265
redmass: 5.5037 7.8621 4.8935 18.3258 5.8583 7.2161 7.9873 1.3567 9.3616 13.9238 7.1370 3.2663 7.9837 5.0829 12.3212 5.8032 13.2914 5.1019 9.1869 8.4633 12.1126 5.2619 6.9495 8.3860 2.9902 4.3601 5.5531 2.9275 4.1802 2.8531 5.8735 3.6857 1.1508 1.1192 7.3533 1.2832 1.4757 5.7183 11.2704 1.3762 1.6846 2.3280 9.2320 1.1204 10.3680 11.8375 1.0552 1.1026 1.0675 1.1006 1.0666
irintensity: 1.3710 1.1588 7.7586 0.0405 6.4082 4.2045 4.5116 120.9381 9.4714 3.0524 10.3307 8.1085 13.2167 4.1362 0.1413 8.3896 0.2858 6.0277 3.1214 4.7727 0.0347 2.8065 1.8091 2.7338 50.2664 54.3754 86.1815 37.5023 89.7781 14.5395 4.7355 29.4223 45.1578 3.6966 17.9335 11.9834 6.0676 1.9418 9.8266 5.0677 87.3611 156.9750 116.0309 10.7128 0.2770 8.7982 66.9393 36.0415 28.9626 4.7620 5.9285
temp: 298.150 k
press: 1.00000 atm
elementType: 9 9 9 9 9 8 6 6 6 6 6 6 6 6 1 1 1 1 1
symmnumber: 1
zpe: 306889.3 jmol-1
zpe.correction: 0.116888 hartree
zpe.thermalcorrener: 0.130195 hartree
zpe.thermalcorrenthalpy: 0.131139 hartree
zpe.thermalcorrgfe: 0.076470 hartree
zpe.sumelectzpe: -881.199570 hartree
zpe.sumelectthermal: -881.186263 hartree
zpe.sumelectthermalent: -881.185318 hartree
zpe.sumelectthermalfe: -881.239987 hartree
dipole: -4.1375 1.3580 -0.0567
dipole: 4.3550
quadrupole: -71.5622 -89.6768 -71.4916
quadrupole: -4.1110 -4.2669 0.8860
quadrupole: 6.0147 -12.0999 6.0852 -4.1110 -4.2669 0.8860
hfenergy: -881.3164575 hartree
pointgroup: C01 [X(C8H5F5O1)]
dipole: -1.5648434 0.6966249 0.0409891 debye
dipolederiv: -0.3045394 0.2381555 -0.0104402 0.2219345 -0.8268954 -0.0084902 -0.0058743 -0.01378 -0.1182636 -0.4009606 -0.3154649 -0.1231277 -0.3007981 -0.6545069 -0.1713167 -0.1148827 -0.167542 -0.1663013 -0.3021242 0.2947495 -0.008962 0.3362618 -0.841721 -0.0270575 -0.0194859 -0.0176401 -0.0884296 -0.4718152 -0.3553382 -0.1273604 -0.4005685 -0.6247725 -0.1523128 -0.1488873 -0.1546526 -0.1329863 -0.9500754 0.1265437 -0.1863263 0.1289317 -0.1772919 0.017824 -0.2137321 0.0218727 -0.1264475 -0.4749192 -0.1360114 -0.1313079 -0.210984 -0.52769 0.2690872 -0.0607629 0.2188843 -0.5484194 0.1291961 -0.0361947 0.0072745 -0.0695698 -0.211687 -0.0549366 -0.0074224 -0.0321605 -0.0928162 0.0548319 -0.0030578 0.0616777 0.0699654 0.0618808 -0.031831 0.1581947 -0.0310431 0.0173858 0.2560813 -0.2976899 0.014188 -0.2321193 0.8753183 0.0223903 0.0049511 0.0171095 0.0760232 0.3972309 0.4259144 0.1443615 0.3512253 0.7170684 0.1900005 0.0875699 0.1948082 0.1660058 0.3492584 0.0672779 0.0145141 0.0578324 0.4617557 -0.1981941 -0.1200702 -0.1825785 0.5101092 0.1816458 -0.4105994 -0.0323788 -0.3997205 0.8851307 0.0176241 -0.0081155 -0.0118545 0.056673 0.3870762 0.4794766 0.1244227 0.5008575 0.5954443 0.1737779 0.1490208 0.1825447 0.1119025 1.0114797 -0.1434913 0.2140565 -0.1558487 0.1173068 -0.0329214 0.2284689 -0.030194 0.1220557 0.0335773 -0.0086221 -0.0080402 -0.0477215 0.0082951 -0.0988824 -0.0241341 -0.0448518 0.0651171 0.0281963 0.0086667 0.0041807 0.0351996 -0.0019328 0.1140266 -0.0127637 0.0703432 0.0268315 -0.2438256 0.0878595 -0.0684789 0.0328533 0.0140868 0.0590385 -0.0204828 0.0543767 0.0037181 0.0577966 -0.0950472 -0.0473452 -0.0443348 -0.1437884 -0.0293314 -0.0244322 -0.0486128 -0.0335815 0.261889 0.072873 0.1590917 0.1266037 0.273999 -0.058495 0.1528406 -0.0250294 0.1514235 unknown
polarizability: 113.3374025|-5.0013035|99.2614773|8.5684826|4.1675032|55.8512527 unknown
InChI: InChI=1S/C8H5F5O/c9-4-3(1-2-14)5(10)7(12)8(13)6(4)11/h14H,1-2H2
charge 0 multiplicity 1
19 atoms
F  -0.506046 2.545847 -0.115006
F  -1.069248 -2.208342 -0.846239
F  1.586129 -2.626333 -0.181403
F  2.163675 2.127726 0.536515
F  3.220546 -0.466392 0.511563
O  -3.00677 -0.472454 1.343569
C  -0.85954 0.178787 -0.48082
C  -2.324751 0.415238 -0.789945
C  0.002018 1.240041 -0.133816
C  -0.288453 -1.11045 -0.490273
C  -3.14147 0.710424 0.483667
C  1.062694 -1.340046 -0.162345
C  1.355574 1.049351 0.198767
C  1.888444 -0.254255 0.185916
H  -2.746653 -0.477564 -1.279065
H  -2.430765 1.272672 -1.478897
H  -4.199945 0.882314 0.197197
H  -2.753257 1.620367 0.985258
H  -3.525382 -0.346731 2.176557
