program: Orca
programVersion: 5.0.2
elementType: O O O C C C C C C C C C C C C C C C C C C C C C C H H H H H H H H H H H H H H H H H H H H H H H H H H
charge: 0
multiplicity: 1
keywords: wb97x-d3
keywords: def2-TZVPP
keywords: def2/J RIJCOSX
keywords: DEFGRID2
keywords: scfconv7
keywords: smallprint printgap noloewdin
keywords: NOSOSCF
formula: C22H26O3
InChI: InChI=1/C22H26O3/c1-15(2)10-19-20(22(19,3)4)21(23)25-14-17-12-18(24-13-17)11-16-8-6-5-7-9-16/h5-10,12-13,19-20H,11,14H2,1-4H3
51 atoms
O  1.001865 -1.208582 0.100953
O  3.118251 -1.832968 0.443939
O  -2.981369 -2.141988 1.639219
C  3.713742 0.511443 -1.571374
C  3.94022 0.988488 -0.171218
C  2.634825 0.309845 -0.516265
C  3.396708 1.532883 -2.635246
C  4.527404 -0.648827 -2.088442
C  3.929085 2.429705 0.188641
C  2.31734 -1.012734 0.050834
C  5.014714 3.205209 0.247683
C  4.923544 4.647274 0.642655
C  6.394006 2.717129 -0.071117
C  0.527913 -2.4447 0.665891
C  -0.946706 -2.338495 0.773495
C  -1.904817 -2.297198 -0.291369
C  -1.661812 -2.238658 1.916765
C  -3.121478 -2.176643 0.287659
C  -4.49281 -2.023027 -0.259846
C  -5.029776 -0.626557 -0.046766
C  -6.105891 -0.391719 0.801276
C  -4.435061 0.454669 -0.694146
C  -6.584566 0.899071 0.997014
C  -4.908907 1.743147 -0.500215
C  -5.987105 1.969532 0.347873
H  4.628531 0.370348 0.398953
H  1.776158 0.964052 -0.622967
H  4.314856 2.001899 -2.99503
H  2.74072 2.324228 -2.274636
H  2.909521 1.060445 -3.489952
H  3.958693 -1.240107 -2.809405
H  4.876215 -1.31547 -1.302797
H  5.410319 -0.267012 -2.605808
H  2.963769 2.871937 0.418207
H  5.318511 5.294837 -0.144134
H  3.898238 4.952801 0.849877
H  5.522392 4.847013 1.534985
H  6.420541 1.673938 -0.382408
H  6.83444 3.315404 -0.872767
H  7.055054 2.82861 0.792349
H  0.971192 -2.606685 1.649639
H  0.820786 -3.273134 0.018162
H  -1.706825 -2.348726 -1.350683
H  -1.378501 -2.231998 2.957896
H  -5.167794 -2.753452 0.193465
H  -4.451272 -2.250386 -1.326647
H  -6.576636 -1.223683 1.311605
H  -3.59269 0.285171 -1.355223
H  -7.424053 1.065865 1.659695
H  -4.437829 2.57254 -1.012118
H  -6.357569 2.974977 0.50025
elementType: O C H
totalener: -1079.74091012 hartree
nucrepener: 2019.67109791 hartree
electener: -3099.41200803 hartree
oneelecener: -5478.43946734 hartree
twoeener: 2379.02745931 hartree
cpcmener: -0.03118548 hartree
kineticenergy: 1074.84988411 hartree
xcener: -106.457662505119 hartree
chargesum: 0.0000000
charge: -0.280673 -0.508098 -0.286401 0.129624 -0.010294 -0.104806 -0.271605 -0.299356 -0.252427 0.428498 -0.044305 -0.230849 -0.248816 0.091716 -0.086712 -0.316736 -0.029314 0.194854 -0.051464 0.020154 -0.188177 -0.190207 -0.157533 -0.163848 -0.174518 0.099017 0.092027 0.096744 0.093058 0.099906 0.103389 0.092297 0.096787 0.123961 0.094677 0.090334 0.095504 0.086677 0.096970 0.101988 0.107329 0.118028 0.165472 0.179901 0.107961 0.118056 0.142579 0.147213 0.159854 0.160111 0.161454
qa: -0.2807 -0.5081 -0.2864 0.1296 -0.0103 -0.1048 -0.2716 -0.2994 -0.2524 0.4285 -0.0443 -0.2308 -0.2488 0.0917 -0.0867 -0.3167 -0.0293 0.1949 -0.0515 0.0202 -0.1882 -0.1902 -0.1575 -0.1638 -0.1745 0.0990 0.0920 0.0967 0.0931 0.0999 0.1034 0.0923 0.0968 0.1240 0.0947 0.0903 0.0955 0.0867 0.0970 0.1020 0.1073 0.1180 0.1655 0.1799 0.1080 0.1181 0.1426 0.1472 0.1599 0.1601 0.1615
va: 2.1236 1.9931 2.2635 3.6678 3.7903 3.8979 3.9084 3.8976 3.8547 4.1267 3.7056 3.9270 3.9370 3.8394 3.7473 3.9855 3.9436 3.6288 3.8168 3.6202 3.9405 3.9276 3.8875 3.9063 3.8930 1.0245 1.0356 1.0008 1.0022 1.0031 0.9991 1.0190 1.0003 1.0056 0.9962 1.0073 0.9953 1.0082 0.9975 0.9987 1.0035 0.9910 1.0067 0.9934 1.0097 1.0060 1.0032 1.0024 0.9900 0.9907 0.9892
dispcorr: -0.021703052 hartree
energy: -1079.762613172132
dipole: 27.42766 -27.84426 -0.41660 18.60878 -17.90880 0.69998 -9.69878 8.92269 -0.77609
magnitude: 1.12509 au
magnitude: 2.85976 debye
