program: Orca
programVersion: 5.0.2
elementType: O O O C C C C C C C C C C C C C C C C C C C C C C H H H H H H H H H H H H H H H H H H H H H H H H H H
charge: 0
multiplicity: 1
keywords: wb97x-d3
keywords: def2-TZVPP
keywords: def2/J RIJCOSX
keywords: DEFGRID2
keywords: scfconv7
keywords: smallprint printgap noloewdin
keywords: NOSOSCF
formula: C22H26O3
InChI: InChI=1/C22H26O3/c1-15(2)10-19-20(22(19,3)4)21(23)25-14-17-12-18(24-13-17)11-16-8-6-5-7-9-16/h5-10,12-13,19-20H,11,14H2,1-4H3
51 atoms
O  1.008128 -1.039125 0.110768
O  3.072227 -1.79103 -0.293451
O  -2.881985 -2.203996 1.700486
C  3.112162 0.918151 -1.979747
C  3.968988 1.010495 -0.750789
C  2.541257 0.522032 -0.630074
C  2.539199 2.174242 -2.588739
C  3.449944 -0.135345 -3.005759
C  4.358966 2.28648 -0.120936
C  2.273125 -0.884062 -0.268901
C  5.598791 2.586684 0.277026
C  5.90882 3.894591 0.937638
C  6.761568 1.644138 0.104754
C  0.585222 -2.339879 0.549414
C  -0.883266 -2.271925 0.743915
C  -1.883833 -2.135318 -0.272315
C  -1.554646 -2.304702 1.917469
C  -3.07708 -2.099031 0.364702
C  -4.473942 -1.920146 -0.10986
C  -5.015139 -0.559243 0.258685
C  -4.742317 0.544986 -0.544593
C  -5.752461 -0.375506 1.423798
C  -5.199459 1.806619 -0.193153
C  -6.21008 0.886785 1.779316
C  -5.934161 1.981739 0.972541
H  4.709544 0.220125 -0.680056
H  1.824039 1.227148 -0.22349
H  3.272453 2.654805 -3.239985
H  2.231405 2.904702 -1.841365
H  1.662755 1.938939 -3.196106
H  4.112312 0.289572 -3.762853
H  2.55263 -0.488555 -3.518713
H  3.957595 -1.000261 -2.582877
H  3.572065 3.017886 0.038818
H  5.025544 4.524642 1.044052
H  6.333051 3.738911 1.93361
H  6.657391 4.45472 0.370417
H  7.694023 2.102396 0.434403
H  6.633676 0.727002 0.68448
H  6.900204 1.34611 -0.936082
H  1.092321 -2.600792 1.481353
H  0.84587 -3.09048 -0.199447
H  -1.726015 -2.07066 -1.337773
H  -1.23221 -2.400885 2.942994
H  -5.115351 -2.70329 0.303331
H  -4.477969 -2.046067 -1.193483
H  -4.166788 0.415488 -1.454138
H  -5.975043 -1.225627 2.058047
H  -4.983248 2.654241 -0.831219
H  -6.783869 1.014172 2.688634
H  -6.291966 2.965653 1.247822
elementType: O C H
totalener: -1079.75440057 hartree
nucrepener: 2020.40242339 hartree
electener: -3100.15682396 hartree
oneelecener: -5479.81380393 hartree
twoeener: 2379.65697997 hartree
cpcmener: -0.02675616 hartree
kineticenergy: 1074.86154518 hartree
xcener: -106.458498869310 hartree
chargesum: 0.0000000
charge: -0.271521 -0.477259 -0.278101 0.100622 0.050073 -0.099055 -0.269640 -0.274617 -0.298186 0.401291 -0.012025 -0.221629 -0.283557 0.081550 -0.083912 -0.322391 -0.025485 0.195662 -0.064127 0.061376 -0.202065 -0.195325 -0.152982 -0.154183 -0.173550 0.087601 0.087213 0.097377 0.087280 0.096848 0.095905 0.098472 0.090521 0.115431 0.084284 0.097409 0.095804 0.094823 0.101886 0.104161 0.113542 0.110443 0.160900 0.174775 0.112897 0.111645 0.140698 0.139005 0.156991 0.156121 0.157004
qa: -0.2715 -0.4773 -0.2781 0.1006 0.0501 -0.0991 -0.2696 -0.2746 -0.2982 0.4013 -0.0120 -0.2216 -0.2836 0.0816 -0.0839 -0.3224 -0.0255 0.1957 -0.0641 0.0614 -0.2021 -0.1953 -0.1530 -0.1542 -0.1736 0.0876 0.0872 0.0974 0.0873 0.0968 0.0959 0.0985 0.0905 0.1154 0.0843 0.0974 0.0958 0.0948 0.1019 0.1042 0.1135 0.1104 0.1609 0.1748 0.1129 0.1116 0.1407 0.1390 0.1570 0.1561 0.1570
va: 2.1212 2.0305 2.2790 3.7109 3.7474 3.8780 3.9139 3.9066 3.8969 4.1626 3.6963 3.9209 3.9398 3.8477 3.7332 4.0035 3.9474 3.6403 3.8255 3.5715 3.9481 3.9584 3.8986 3.8971 3.9027 1.0318 1.0361 1.0017 1.0060 1.0022 1.0006 0.9995 1.0182 1.0109 1.0104 0.9925 0.9930 1.0047 0.9971 0.9956 0.9989 0.9961 1.0082 0.9949 1.0070 1.0089 1.0039 1.0072 0.9909 0.9910 0.9907
dispcorr: -0.021105069 hartree
energy: -1079.775505642783
dipole: 26.29183 -26.81356 -0.52173 17.27403 -16.64894 0.62509 -9.20064 8.87535 -0.32529
magnitude: 0.87678 au
magnitude: 2.22861 debye
