program: Orca
programVersion: 5.0.2
elementType: O O O C C C C C C C C C C C C C C C C C C C C C C H H H H H H H H H H H H H H H H H H H H H H H H H H
charge: 0
multiplicity: 1
keywords: wb97x-d3
keywords: def2-TZVPP
keywords: def2/J RIJCOSX
keywords: DEFGRID2
keywords: scfconv7
keywords: smallprint printgap noloewdin
keywords: NOSOSCF
formula: C22H26O3
InChI: InChI=1/C22H26O3/c1-15(2)10-19-20(22(19,3)4)21(23)25-14-17-12-18(24-13-17)11-16-8-6-5-7-9-16/h5-10,12-13,19-20H,11,14H2,1-4H3
51 atoms
O  1.730515 -2.197679 0.029966
O  1.148914 -1.253035 -1.913116
O  -2.298791 -2.740758 1.501713
C  1.802025 1.290688 -0.132951
C  2.817669 1.122926 -1.227361
C  2.49308 -0.049483 -0.340015
C  2.185533 2.046118 1.114944
C  0.349026 1.461901 -0.50407
C  4.168691 1.729433 -1.143671
C  1.725023 -1.200988 -0.851551
C  4.590441 2.787862 -1.841095
C  5.986856 3.31065 -1.688817
C  3.73638 3.541974 -2.812919
C  0.875816 -3.330659 -0.206567
C  -0.518504 -3.020062 0.206876
C  -1.551105 -2.374075 -0.548698
C  -1.0388 -3.213785 1.442119
C  -2.605663 -2.227392 0.286542
C  -3.922254 -1.554943 0.141584
C  -3.915007 -0.209857 0.829782
C  -4.337401 -0.079567 2.149029
C  -3.424855 0.912823 0.167626
C  -4.272196 1.148814 2.794095
C  -3.360541 2.14168 0.808672
C  -3.783439 2.262911 2.126217
H  2.388032 1.066487 -2.223184
H  3.224938 -0.299797 0.421259
H  1.543459 1.759903 1.950474
H  2.067057 3.121177 0.961581
H  3.217476 1.867745 1.416426
H  0.094977 1.020684 -1.465817
H  0.107038 2.525445 -0.561093
H  -0.303152 1.019708 0.252343
H  4.865087 1.265347 -0.450428
H  5.982902 4.349834 -1.348898
H  6.570733 2.726907 -0.976906
H  6.517056 3.301822 -2.645046
H  3.67948 4.596992 -2.531689
H  4.170492 3.516126 -3.816045
H  2.717169 3.165182 -2.879693
H  1.293238 -4.12506 0.410285
H  0.932815 -3.648524 -1.248009
H  -1.510958 -2.059722 -1.579189
H  -0.643246 -3.664979 2.339348
H  -4.718743 -2.183887 0.547374
H  -4.12398 -1.432044 -0.923367
H  -4.723533 -0.943491 2.677412
H  -3.086804 0.824864 -0.858871
H  -4.605661 1.235019 3.820593
H  -2.979095 3.005404 0.278642
H  -3.733959 3.220661 2.62836
elementType: O C H
totalener: -1079.75329447 hartree
nucrepener: 2140.47864136 hartree
electener: -3220.23193583 hartree
oneelecener: -5720.37241143 hartree
twoeener: 2500.14047560 hartree
cpcmener: -0.02476087 hartree
kineticenergy: 1074.86756271 hartree
xcener: -106.461198065713 hartree
chargesum: -0.0000000
charge: -0.279622 -0.469323 -0.275683 0.175672 -0.002416 -0.130925 -0.267368 -0.325078 -0.270864 0.406345 -0.033940 -0.227491 -0.250889 0.067293 -0.062298 -0.345480 -0.035679 0.218209 -0.055388 0.099636 -0.204180 -0.260219 -0.150726 -0.145402 -0.171446 0.095931 0.090728 0.098899 0.095340 0.090267 0.097253 0.100194 0.103698 0.119562 0.093005 0.088386 0.094072 0.094544 0.097515 0.087950 0.118614 0.118571 0.157590 0.172998 0.112624 0.111217 0.139133 0.146512 0.156234 0.159221 0.157204
qa: -0.2796 -0.4693 -0.2757 0.1757 -0.0024 -0.1309 -0.2674 -0.3251 -0.2709 0.4063 -0.0339 -0.2275 -0.2509 0.0673 -0.0623 -0.3455 -0.0357 0.2182 -0.0554 0.0996 -0.2042 -0.2602 -0.1507 -0.1454 -0.1714 0.0959 0.0907 0.0989 0.0953 0.0903 0.0973 0.1002 0.1037 0.1196 0.0930 0.0884 0.0941 0.0945 0.0975 0.0879 0.1186 0.1186 0.1576 0.1730 0.1126 0.1112 0.1391 0.1465 0.1562 0.1592 0.1572
va: 2.1231 2.0396 2.2794 3.6589 3.7846 3.8833 3.8977 3.9080 3.8723 4.1983 3.7097 3.9270 3.9435 3.8544 3.6484 3.9811 3.9700 3.6162 3.8175 3.5180 3.9694 3.9280 3.8951 3.8634 3.9074 1.0262 1.0380 1.0030 1.0030 1.0034 1.0172 1.0028 0.9906 1.0078 0.9965 1.0082 0.9953 0.9976 0.9978 1.0087 0.9966 1.0076 1.0198 0.9944 1.0093 1.0096 1.0075 1.0007 0.9907 0.9892 0.9902
dispcorr: -0.024955740 hartree
energy: -1079.778250209176
dipole: 17.46467 -17.28296 0.18171 23.26180 -22.91511 0.34669 -5.25546 5.88980 0.63434
magnitude: 0.74539 au
magnitude: 1.89462 debye
