program: Orca
programVersion: 5.0.2
elementType: O O O C C C C C C C C C C C C C C C C C C C C C C H H H H H H H H H H H H H H H H H H H H H H H H H H
charge: 0
multiplicity: 1
keywords: wb97x-d3
keywords: def2-TZVPP
keywords: def2/J RIJCOSX
keywords: DEFGRID2
keywords: scfconv7
keywords: smallprint printgap noloewdin
keywords: NOSOSCF
formula: C22H26O3
InChI: InChI=1/C22H26O3/c1-15(2)10-19-20(22(19,3)4)21(23)25-14-17-12-18(24-13-17)11-16-8-6-5-7-9-16/h5-10,12-13,19-20H,11,14H2,1-4H3
51 atoms
O  0.976549 -1.429636 -1.74565
O  0.516517 0.653439 -1.082516
O  -1.465637 -2.668347 1.557975
C  3.44761 0.353415 0.079278
C  3.452252 1.252347 -1.121605
C  2.788825 -0.098511 -1.21571
C  4.720447 -0.365238 0.452135
C  2.611789 0.743972 1.272723
C  4.684464 1.507207 -1.908923
C  1.322186 -0.212644 -1.330169
C  5.43823 2.606611 -1.821583
C  6.657279 2.784345 -2.674752
C  5.146212 3.741364 -0.888843
C  -0.421311 -1.740883 -1.825953
C  -1.038501 -1.902477 -0.478568
C  -2.08006 -1.115514 0.108267
C  -0.711117 -2.830136 0.451549
C  -2.302901 -1.626827 1.342718
C  -3.217944 -1.250325 2.456229
C  -4.407845 -0.474384 1.958308
C  -5.509606 -1.144152 1.430759
C  -4.422513 0.915998 1.991536
C  -6.60666 -0.44028 0.957341
C  -5.518352 1.62475 1.514339
C  -6.614353 0.948553 0.998506
H  2.760745 2.087035 -1.04975
H  3.337151 -0.865703 -1.75263
H  4.503592 -1.236556 1.073546
H  5.378163 0.293264 1.024056
H  5.27829 -0.711213 -0.417803
H  1.759135 1.369075 1.015535
H  3.225865 1.308035 1.978101
H  2.236836 -0.136629 1.799258
H  4.987604 0.73163 -2.606833
H  6.819676 1.939789 -3.34466
H  6.58097 3.68773 -3.28613
H  7.553475 2.904382 -2.060129
H  6.018509 3.960252 -0.267408
H  4.92939 4.657762 -1.444759
H  4.307198 3.547796 -0.222328
H  -0.45341 -2.673761 -2.387373
H  -0.951878 -0.986419 -2.409048
H  -2.591504 -0.280705 -0.34484
H  0.009251 -3.633857 0.466062
H  -2.673378 -0.660911 3.200773
H  -3.552794 -2.156302 2.968517
H  -5.51069 -2.227623 1.395676
H  -3.571588 1.451263 2.396705
H  -7.458513 -0.976412 0.558307
H  -5.515698 2.706837 1.549781
H  -7.4711 1.499045 0.631164
elementType: O C H
totalener: -1079.75213082 hartree
nucrepener: 2061.11472979 hartree
electener: -3140.86686062 hartree
oneelecener: -5561.70654764 hartree
twoeener: 2420.83968703 hartree
cpcmener: -0.02532536 hartree
kineticenergy: 1074.85571003 hartree
xcener: -106.459378938475 hartree
chargesum: -0.0000000
charge: -0.282087 -0.469067 -0.276200 0.144290 -0.010733 -0.123873 -0.267396 -0.294631 -0.260237 0.397868 -0.033064 -0.228362 -0.251591 0.087469 -0.084618 -0.289028 -0.048445 0.171997 -0.005246 0.003250 -0.197109 -0.186254 -0.149405 -0.153211 -0.167641 0.098247 0.090225 0.098060 0.095185 0.090666 0.093493 0.096243 0.099791 0.119271 0.088333 0.093523 0.093628 0.094010 0.099828 0.088199 0.121127 0.118670 0.160715 0.172905 0.101986 0.107334 0.139734 0.140501 0.156642 0.156967 0.158036
qa: -0.2821 -0.4691 -0.2762 0.1443 -0.0107 -0.1239 -0.2674 -0.2946 -0.2602 0.3979 -0.0331 -0.2284 -0.2516 0.0875 -0.0846 -0.2890 -0.0484 0.1720 -0.0052 0.0032 -0.1971 -0.1863 -0.1494 -0.1532 -0.1676 0.0982 0.0902 0.0981 0.0952 0.0907 0.0935 0.0962 0.0998 0.1193 0.0883 0.0935 0.0936 0.0940 0.0998 0.0882 0.1211 0.1187 0.1607 0.1729 0.1020 0.1073 0.1397 0.1405 0.1566 0.1570 0.1580
va: 2.1279 2.0419 2.2764 3.6719 3.7882 3.8637 3.9041 3.9016 3.8660 4.2087 3.7037 3.9283 3.9414 3.8312 3.6562 3.9634 3.9544 3.6845 3.8034 3.6400 3.9386 3.9195 3.8914 3.8964 3.8956 1.0247 1.0380 1.0030 1.0027 1.0028 1.0186 1.0010 0.9997 1.0077 1.0081 0.9952 0.9965 0.9980 0.9979 1.0077 0.9935 1.0047 1.0060 0.9956 1.0030 1.0096 1.0036 1.0042 0.9907 0.9907 0.9901
dispcorr: -0.022770161 hartree
energy: -1079.774900985323
dipole: 28.11368 -27.47620 0.63747 14.58431 -14.97815 -0.39385 -1.39648 1.44172 0.04525
magnitude: 0.75069 au
magnitude: 1.90810 debye
