program: Orca
programVersion: 5.0.2
elementType: O O O C C C C C C C C C C C C C C C C C C C C C C H H H H H H H H H H H H H H H H H H H H H H H H H H
charge: 0
multiplicity: 1
keywords: wb97x-d3
keywords: def2-TZVPP
keywords: def2/J RIJCOSX
keywords: DEFGRID2
keywords: scfconv7
keywords: smallprint printgap noloewdin
keywords: NOSOSCF
formula: C22H26O3
InChI: InChI=1/C22H26O3/c1-15(2)10-19-20(22(19,3)4)21(23)25-14-17-12-18(24-13-17)11-16-8-6-5-7-9-16/h5-10,12-13,19-20H,11,14H2,1-4H3
51 atoms
O  1.467578 -2.197586 -1.250051
O  1.953045 -1.820161 0.897547
O  -2.16878 -3.221711 1.247711
C  3.696972 0.520569 -0.233107
C  2.346727 1.073691 0.108501
C  2.453716 -0.165468 -0.764902
C  4.541748 1.227982 -1.265511
C  4.5182 -0.102165 0.869047
C  1.817562 2.317603 -0.487949
C  1.952717 -1.454286 -0.253545
C  1.379833 3.392579 0.175716
C  0.858888 4.589042 -0.562164
C  1.372327 3.528303 1.667547
C  0.783594 -3.408702 -0.91335
C  -0.487453 -3.122463 -0.193809
C  -1.396533 -2.049245 -0.46202
C  -1.008033 -3.793962 0.856967
C  -2.391598 -2.152328 0.451265
C  -3.610012 -1.339504 0.72085
C  -3.447387 0.08845 0.267741
C  -4.270286 0.627776 -0.713875
C  -2.463166 0.897357 0.835256
C  -4.117804 1.948201 -1.122749
C  -2.307456 2.213245 0.429539
C  -3.135438 2.743656 -0.553548
H  2.032847 0.868367 1.126913
H  2.26611 -0.005766 -1.821147
H  3.9564 1.620666 -2.096287
H  5.285953 0.546367 -1.682285
H  5.077989 2.065042 -0.813079
H  5.181058 0.65271 1.297499
H  5.147352 -0.908174 0.485145
H  3.91621 -0.503662 1.680653
H  1.788128 2.349866 -1.57345
H  0.899784 4.459235 -1.643743
H  -0.179214 4.797459 -0.287607
H  1.428813 5.487371 -0.309015
H  1.636056 2.613461 2.195168
H  2.078152 4.302212 1.982789
H  0.389804 3.848483 2.024208
H  1.424681 -4.077467 -0.33467
H  0.594736 -3.883005 -1.876591
H  -1.30475 -1.289373 -1.222333
H  -0.67446 -4.653305 1.41796
H  -3.822883 -1.365542 1.79381
H  -4.479714 -1.786139 0.229391
H  -5.039697 0.012087 -1.16497
H  -1.810527 0.492536 1.600322
H  -4.768776 2.352217 -1.887748
H  -1.540074 2.827579 0.884214
H  -3.015104 3.771818 -0.870593
elementType: O C H
totalener: -1079.75168704 hartree
nucrepener: 2183.63669466 hartree
electener: -3263.38838170 hartree
oneelecener: -5806.67581675 hartree
twoeener: 2543.28743506 hartree
cpcmener: -0.02662715 hartree
kineticenergy: 1074.85565216 hartree
xcener: -106.462841384099 hartree
chargesum: -0.0000000
charge: -0.289221 -0.466003 -0.278979 0.122932 0.033059 -0.097554 -0.265425 -0.282857 -0.255614 0.386615 -0.091718 -0.209909 -0.251522 0.110416 -0.075969 -0.320926 -0.046050 0.196636 -0.029605 0.028832 -0.185949 -0.246079 -0.130585 -0.117436 -0.199387 0.098679 0.085222 0.087218 0.097628 0.096205 0.093503 0.097704 0.093915 0.116688 0.090386 0.083052 0.099399 0.092297 0.106283 0.090530 0.115391 0.114945 0.157948 0.173834 0.110039 0.097461 0.139484 0.142717 0.156212 0.171308 0.154250
qa: -0.2892 -0.4660 -0.2790 0.1229 0.0331 -0.0976 -0.2654 -0.2829 -0.2556 0.3866 -0.0917 -0.2099 -0.2515 0.1104 -0.0760 -0.3209 -0.0461 0.1966 -0.0296 0.0288 -0.1859 -0.2461 -0.1306 -0.1174 -0.1994 0.0987 0.0852 0.0872 0.0976 0.0962 0.0935 0.0977 0.0939 0.1167 0.0904 0.0831 0.0994 0.0923 0.1063 0.0905 0.1154 0.1149 0.1579 0.1738 0.1100 0.0975 0.1395 0.1427 0.1562 0.1713 0.1542
va: 2.1149 2.0364 2.2766 3.7015 3.7592 3.8556 3.9087 3.8971 3.8245 4.1541 3.7728 3.9140 3.9315 3.8307 3.6787 3.9561 3.9570 3.6504 3.8008 3.6321 3.9332 3.9801 3.8910 3.8167 3.9314 1.0274 1.0401 1.0053 1.0023 1.0025 1.0003 0.9996 1.0212 1.0107 1.0084 0.9970 0.9977 1.0094 0.9970 0.9979 1.0058 0.9872 1.0088 0.9949 1.0076 1.0062 1.0043 1.0044 0.9909 0.9724 0.9939
dispcorr: -0.025457863 hartree
energy: -1079.777144901610
dipole: 15.35065 -15.38872 -0.03807 22.96634 -22.33411 0.63222 -0.77764 -0.06716 -0.84480
magnitude: 1.05586 au
magnitude: 2.68379 debye
