program: Orca
programVersion: 5.0.2
elementType: O O O C C C C C C C C C C C C C C C C C C C C C C H H H H H H H H H H H H H H H H H H H H H H H H H H
charge: 0
multiplicity: 1
keywords: wb97x-d3
keywords: def2-TZVPP
keywords: def2/J RIJCOSX
keywords: DEFGRID2
keywords: scfconv7
keywords: smallprint printgap noloewdin
keywords: NOSOSCF
formula: C22H26O3
InChI: InChI=1/C22H26O3/c1-15(2)10-19-20(22(19,3)4)21(23)25-14-17-12-18(24-13-17)11-16-8-6-5-7-9-16/h5-10,12-13,19-20H,11,14H2,1-4H3
51 atoms
O  1.341483 -1.506408 -1.169926
O  0.64984 0.597581 -1.482132
O  -1.741762 -1.617499 1.686566
C  3.212597 1.188215 0.280455
C  3.460763 1.525815 -1.149038
C  2.902286 0.160041 -0.800533
C  4.381983 0.842896 1.169972
C  2.095927 1.88395 1.019457
C  4.827488 1.643725 -1.721043
C  1.521957 -0.18213 -1.181081
C  5.154063 1.339004 -2.979789
C  6.553814 1.504089 -3.486748
C  4.173395 0.811271 -3.981241
C  0.048559 -2.009579 -1.493825
C  -0.889442 -1.909759 -0.341619
C  -2.296141 -2.174198 -0.379901
C  -0.611971 -1.58068 0.940244
C  -2.759329 -1.981909 0.877996
C  -4.118384 -2.045657 1.47235
C  -4.613389 -0.683197 1.898008
C  -4.881377 0.293736 0.941048
C  -4.790789 -0.37206 3.24102
C  -5.32133 1.552439 1.319631
C  -5.231214 0.889251 3.624149
C  -5.497949 1.854676 2.664873
H  2.720883 2.194217 -1.583713
H  3.599076 -0.669441 -0.846152
H  4.8341 1.747842 1.581952
H  5.161902 0.290094 0.646061
H  4.053041 0.229323 2.011016
H  1.294712 2.228426 0.368771
H  2.491628 2.760797 1.536479
H  1.657736 1.230448 1.776913
H  5.602961 2.029863 -1.064913
H  7.232119 1.870171 -2.715943
H  6.949041 0.556013 -3.861354
H  6.588345 2.204274 -4.325805
H  4.466325 -0.185956 -4.321345
H  3.155649 0.747182 -3.599863
H  4.154767 1.444335 -4.872353
H  0.210357 -3.053224 -1.768124
H  -0.361297 -1.505798 -2.372546
H  -2.883053 -2.462399 -1.238347
H  0.29472 -1.308483 1.457883
H  -4.12603 -2.726443 2.328003
H  -4.789265 -2.474355 0.725311
H  -4.742109 0.067314 -0.110167
H  -4.584973 -1.121534 3.996329
H  -5.527416 2.299839 0.56388
H  -5.364802 1.115988 4.674417
H  -5.841058 2.83778 2.960965
elementType: O C H
totalener: -1079.75292181 hartree
nucrepener: 2073.63777571 hartree
electener: -3153.39069751 hartree
oneelecener: -5586.69853983 hartree
twoeener: 2433.30784231 hartree
cpcmener: -0.02691163 hartree
kineticenergy: 1074.85613651 hartree
xcener: -106.461719408168 hartree
chargesum: -0.0000000
charge: -0.292304 -0.466633 -0.282856 0.156191 -0.029629 -0.089190 -0.288065 -0.278453 -0.290236 0.360092 -0.012297 -0.227683 -0.242632 0.104677 -0.028426 -0.350564 -0.058338 0.212079 -0.060756 0.024708 -0.185040 -0.180772 -0.160357 -0.155801 -0.167508 0.104187 0.093048 0.098477 0.092359 0.097335 0.094993 0.097494 0.094577 0.121756 0.088921 0.093584 0.095614 0.097901 0.080738 0.100199 0.121964 0.113868 0.160058 0.169730 0.106614 0.116745 0.142374 0.138599 0.156357 0.155835 0.156462
qa: -0.2923 -0.4666 -0.2829 0.1562 -0.0296 -0.0892 -0.2881 -0.2785 -0.2902 0.3601 -0.0123 -0.2277 -0.2426 0.1047 -0.0284 -0.3506 -0.0583 0.2121 -0.0608 0.0247 -0.1850 -0.1808 -0.1604 -0.1558 -0.1675 0.1042 0.0930 0.0985 0.0924 0.0973 0.0950 0.0975 0.0946 0.1218 0.0889 0.0936 0.0956 0.0979 0.0807 0.1002 0.1220 0.1139 0.1601 0.1697 0.1066 0.1167 0.1424 0.1386 0.1564 0.1558 0.1565
va: 2.1147 2.0272 2.2714 3.6994 3.8349 3.7936 3.9076 3.8862 3.8882 4.1750 3.7075 3.9307 3.9378 3.8268 3.6202 4.0077 3.9542 3.6193 3.8237 3.6195 3.9345 3.9454 3.9109 3.8961 3.8978 1.0269 1.0319 0.9996 1.0019 1.0030 1.0170 1.0023 1.0021 1.0034 1.0065 0.9964 0.9962 0.9984 1.0152 0.9995 0.9908 1.0117 1.0061 0.9980 1.0083 1.0059 1.0038 1.0042 0.9916 0.9913 0.9908
dispcorr: -0.023027790 hartree
energy: -1079.775949596412
dipole: 24.75262 -24.19059 0.56203 9.62322 -10.43959 -0.81636 -7.54525 7.33970 -0.20555
magnitude: 1.01222 au
magnitude: 2.57285 debye
