program: Orca
programVersion: 5.0.2
elementType: O O O C C C C C C C C C C C C C C C C C C C C C C H H H H H H H H H H H H H H H H H H H H H H H H H H
charge: 0
multiplicity: 1
keywords: wb97x-d3
keywords: def2-TZVPP
keywords: def2/J RIJCOSX
keywords: DEFGRID2
keywords: scfconv7
keywords: smallprint printgap noloewdin
keywords: NOSOSCF
formula: C22H26O3
InChI: InChI=1/C22H26O3/c1-15(2)10-19-20(22(19,3)4)21(23)25-14-17-12-18(24-13-17)11-16-8-6-5-7-9-16/h5-10,12-13,19-20H,11,14H2,1-4H3
51 atoms
O  1.781328 -2.156256 -0.893616
O  2.484414 -1.833712 1.204343
O  -1.962256 -1.937881 1.274452
C  4.158637 0.525963 -0.067541
C  2.878882 1.027466 0.500893
C  2.856715 -0.154212 -0.459111
C  4.820822 1.309325 -1.175748
C  5.143191 -0.170454 0.838898
C  2.233551 2.30134 0.093901
C  2.390731 -1.449641 0.060683
C  0.910696 2.457452 -0.008418
C  0.304074 3.757297 -0.438509
C  -0.060007 1.344905 0.261626
C  0.964544 -3.265093 -0.480464
C  -0.355277 -2.761403 -0.013092
C  -1.472113 -2.394154 -0.832122
C  -0.716353 -2.452737 1.25526
C  -2.419458 -1.903403 0.000738
C  -3.767782 -1.321171 -0.229033
C  -3.748714 0.187844 -0.15687
C  -3.985142 0.851445 1.043165
C  -3.453798 0.939068 -1.29164
C  -3.929942 2.238013 1.107375
C  -3.400919 2.324182 -1.231591
C  -3.637378 2.97887 -0.02965
H  2.709518 0.736162 1.535377
H  2.515679 0.06688 -1.464019
H  4.100204 1.7747 -1.848909
H  5.461117 0.660605 -1.776513
H  5.44939 2.102054 -0.764037
H  4.671124 -0.658446 1.688668
H  5.855989 0.556222 1.23459
H  5.714178 -0.924056 0.292545
H  2.881805 3.146578 -0.120715
H  1.059411 4.509916 -0.665929
H  -0.315181 3.622637 -1.329624
H  -0.354274 4.16148 0.335083
H  0.355559 0.557742 0.889174
H  -0.957374 1.721225 0.757155
H  -0.388883 0.882624 -0.673518
H  1.467501 -3.862184 0.280256
H  0.85405 -3.880402 -1.371974
H  -1.552424 -2.490363 -1.903964
H  -0.21707 -2.552563 2.206411
H  -4.477346 -1.723256 0.49898
H  -4.109246 -1.641625 -1.214278
H  -4.219756 0.282133 1.935183
H  -3.26473 0.434949 -2.232695
H  -4.118586 2.740361 2.047899
H  -3.176137 2.892932 -2.125138
H  -3.596558 4.059596 0.019292
elementType: O C H
totalener: -1079.75214175 hartree
nucrepener: 2217.71598042 hartree
electener: -3297.46812217 hartree
oneelecener: -5874.85467739 hartree
twoeener: 2577.38655521 hartree
cpcmener: -0.02326952 hartree
kineticenergy: 1074.86260817 hartree
xcener: -106.462813645559 hartree
chargesum: -0.0000000
charge: -0.289774 -0.474623 -0.273904 0.157915 -0.003950 -0.071232 -0.285090 -0.280378 -0.317263 0.347586 0.065775 -0.264902 -0.304748 0.093618 -0.061732 -0.343338 -0.027386 0.204688 -0.058889 0.072655 -0.197061 -0.227056 -0.132636 -0.135733 -0.192605 0.099578 0.087054 0.092360 0.096868 0.098638 0.090945 0.092632 0.098353 0.120748 0.097313 0.096023 0.098737 0.093962 0.099566 0.109222 0.116062 0.117446 0.157323 0.168546 0.113084 0.111875 0.137958 0.138181 0.154992 0.156026 0.156572
qa: -0.2898 -0.4746 -0.2739 0.1579 -0.0040 -0.0712 -0.2851 -0.2804 -0.3173 0.3476 0.0658 -0.2649 -0.3047 0.0936 -0.0617 -0.3433 -0.0274 0.2047 -0.0589 0.0727 -0.1971 -0.2271 -0.1326 -0.1357 -0.1926 0.0996 0.0871 0.0924 0.0969 0.0986 0.0909 0.0926 0.0984 0.1207 0.0973 0.0960 0.0987 0.0940 0.0996 0.1092 0.1161 0.1174 0.1573 0.1685 0.1131 0.1119 0.1380 0.1382 0.1550 0.1560 0.1566
va: 2.1029 2.0210 2.2677 3.7047 3.8016 3.7853 3.9064 3.8880 3.9071 4.2091 3.6315 3.9413 3.9743 3.8197 3.6259 3.9938 3.9217 3.6040 3.8106 3.5416 3.9555 3.9020 3.8631 3.8231 3.8691 1.0287 1.0362 1.0015 1.0032 0.9997 1.0202 1.0010 0.9994 1.0050 1.0103 0.9947 0.9951 1.0163 1.0031 0.9899 1.0148 0.9939 1.0083 1.0055 1.0098 1.0095 1.0085 1.0054 0.9911 0.9915 0.9924
dispcorr: -0.028779160 hartree
energy: -1079.780920914707
dipole: 11.77512 -12.35928 -0.58416 16.09895 -15.74133 0.35762 -3.98575 2.84687 -1.13887
magnitude: 1.32897 au
magnitude: 3.37798 debye
