program: Orca
programVersion: 5.0.2
elementType: O O O C C C C C C C C C C C C C C C C C C C C C C H H H H H H H H H H H H H H H H H H H H H H H H H H
charge: 0
multiplicity: 1
keywords: wb97x-d3
keywords: def2-TZVPP
keywords: def2/J RIJCOSX
keywords: DEFGRID2
keywords: scfconv7
keywords: smallprint printgap noloewdin
keywords: NOSOSCF
formula: C22H26O3
InChI: InChI=1/C22H26O3/c1-15(2)10-19-20(22(19,3)4)21(23)25-14-17-12-18(24-13-17)11-16-8-6-5-7-9-16/h5-10,12-13,19-20H,11,14H2,1-4H3
51 atoms
O  1.70706 -1.80218 0.114193
O  1.778835 0.168231 1.169379
O  -1.96157 -0.400081 -1.347043
C  4.709875 0.253459 0.032853
C  3.810496 1.057115 -0.839833
C  3.424621 -0.3738 -0.48355
C  5.976338 -0.332807 -0.54371
C  4.849837 0.640129 1.485036
C  4.133381 1.414616 -2.242076
C  2.242829 -0.602297 0.362891
C  3.248617 1.878635 -3.129669
C  3.664844 2.260655 -4.517057
C  1.792157 2.059334 -2.829338
C  0.483421 -2.132101 0.766814
C  -0.677403 -1.4601 0.117379
C  -1.989635 -1.307149 0.669064
C  -0.723087 -0.892472 -1.109689
C  -2.726324 -0.657176 -0.264711
C  -4.149244 -0.222298 -0.326386
C  -4.770919 -0.094198 1.038629
C  -5.770213 -0.965392 1.456677
C  -4.353541 0.912522 1.907874
C  -6.348172 -0.832558 2.714076
C  -4.926981 1.04758 3.162538
C  -5.928445 0.173987 3.570206
H  3.220767 1.795758 -0.303631
H  3.563812 -1.110967 -1.266116
H  6.305983 -1.184952 0.053916
H  6.781774 0.40479 -0.536533
H  5.853775 -0.682897 -1.568661
H  5.018073 -0.237188 2.112944
H  3.984102 1.171474 1.873439
H  5.713941 1.297097 1.603958
H  5.167603 1.307353 -2.556283
H  3.12129 1.677687 -5.265421
H  3.437375 3.31053 -4.720895
H  4.73165 2.110308 -4.683426
H  1.504699 1.707092 -1.839498
H  1.507958 3.112677 -2.90439
H  1.181013 1.526588 -3.562813
H  0.525874 -1.896241 1.832332
H  0.401245 -3.216643 0.680267
H  -2.326813 -1.635557 1.639758
H  0.00653 -0.756133 -1.892758
H  -4.725921 -0.930563 -0.929546
H  -4.205939 0.736649 -0.850076
H  -6.105826 -1.753799 0.79304
H  -3.574313 1.599417 1.597516
H  -7.128159 -1.517428 3.021938
H  -4.594499 1.838202 3.823356
H  -6.37936 0.281026 4.548579
elementType: O C H
totalener: -1079.75221450 hartree
nucrepener: 2075.86775756 hartree
electener: -3155.61997207 hartree
oneelecener: -5590.90598309 hartree
twoeener: 2435.28601103 hartree
cpcmener: -0.02502100 hartree
kineticenergy: 1074.84797411 hartree
xcener: -106.461238578464 hartree
chargesum: 0.0000000
charge: -0.292690 -0.468066 -0.284353 0.155132 -0.037696 -0.059776 -0.295585 -0.274162 -0.277518 0.349930 -0.004880 -0.230232 -0.259787 0.113448 -0.048296 -0.325930 -0.063984 0.193823 -0.020686 0.000765 -0.171637 -0.209889 -0.153262 -0.142305 -0.171547 0.100926 0.089501 0.098906 0.101461 0.089140 0.098760 0.093288 0.093811 0.123295 0.094201 0.094603 0.088292 0.076840 0.103997 0.096368 0.112854 0.119011 0.161361 0.178575 0.098517 0.111725 0.138629 0.144546 0.155918 0.157035 0.157623
qa: -0.2927 -0.4681 -0.2844 0.1551 -0.0377 -0.0598 -0.2956 -0.2742 -0.2775 0.3499 -0.0049 -0.2302 -0.2598 0.1134 -0.0483 -0.3259 -0.0640 0.1938 -0.0207 0.0008 -0.1716 -0.2099 -0.1533 -0.1423 -0.1715 0.1009 0.0895 0.0989 0.1015 0.0891 0.0988 0.0933 0.0938 0.1233 0.0942 0.0946 0.0883 0.0768 0.1040 0.0964 0.1129 0.1190 0.1614 0.1786 0.0985 0.1117 0.1386 0.1445 0.1559 0.1570 0.1576
va: 2.1158 2.0267 2.2697 3.7306 3.8243 3.7881 3.9172 3.8819 3.8904 4.1832 3.6920 3.9300 3.9497 3.8177 3.6709 3.9854 3.9445 3.6548 3.7960 3.6332 3.9199 3.9392 3.8964 3.8830 3.8994 1.0235 1.0340 1.0023 0.9984 1.0014 0.9994 1.0190 1.0009 1.0037 0.9966 0.9954 1.0070 1.0124 1.0002 0.9968 1.0128 0.9908 1.0019 0.9913 1.0065 1.0070 1.0045 1.0010 0.9912 0.9906 0.9903
dispcorr: -0.023091958 hartree
energy: -1079.775306461187
dipole: 21.64703 -21.50966 0.13737 8.48529 -9.05287 -0.56758 -8.84045 8.26031 -0.58015
magnitude: 0.82316 au
magnitude: 2.09230 debye
