program: Orca
programVersion: 5.0.2
elementType: O O O C C C C C C C C C C C C C C C C C C C C C C H H H H H H H H H H H H H H H H H H H H H H H H H H
charge: 0
multiplicity: 1
keywords: wb97x-d3
keywords: def2-TZVPP
keywords: def2/J RIJCOSX
keywords: DEFGRID2
keywords: scfconv7
keywords: smallprint printgap noloewdin
keywords: NOSOSCF
formula: C22H26O3
InChI: InChI=1/C22H26O3/c1-15(2)10-19-20(22(19,3)4)21(23)25-14-17-12-18(24-13-17)11-16-8-6-5-7-9-16/h5-10,12-13,19-20H,11,14H2,1-4H3
51 atoms
O  1.292768 -1.532294 -0.812748
O  2.160354 -0.75543 1.096144
O  -2.301858 0.240345 0.441027
C  4.584229 -0.304316 -0.928339
C  3.993266 0.996452 -0.468685
C  3.082496 -0.079635 -1.00858
C  5.316309 -0.358044 -2.246394
C  5.157539 -1.240751 0.106312
C  4.155173 2.250954 -1.23637
C  2.157102 -0.796318 -0.110377
C  4.770903 3.359882 -0.813689
C  4.85919 4.572007 -1.69123
C  5.426287 3.508753 0.524886
C  0.310674 -2.275811 -0.093285
C  -0.830922 -1.415664 0.324135
C  -1.812085 -1.728344 1.318781
C  -1.183692 -0.209117 -0.175501
C  -2.678777 -0.687334 1.344646
C  -3.917554 -0.421126 2.121158
C  -5.14973 -0.491599 1.250805
C  -5.821598 -1.698685 1.078546
C  -5.610968 0.635074 0.57572
C  -6.933837 -1.779114 0.252341
C  -6.721622 0.557076 -0.253813
C  -7.386836 -0.6503 -0.418139
H  3.962248 1.106938 0.610459
H  2.705408 0.068906 -2.015335
H  5.34565 -1.380736 -2.627611
H  6.348584 -0.022349 -2.123938
H  4.856374 0.265412 -3.012524
H  5.040231 -2.282989 -0.199015
H  4.70483 -1.125352 1.089357
H  6.227417 -1.052891 0.218909
H  3.73198 2.258607 -2.237168
H  4.373106 4.420117 -2.655352
H  4.394126 5.43844 -1.212772
H  5.900968 4.846768 -1.878954
H  6.495564 3.704815 0.405631
H  5.016556 4.366582 1.064964
H  5.32483 2.633924 1.164506
H  0.75252 -2.783718 0.766518
H  -0.021923 -3.048056 -0.788611
H  -1.861417 -2.61377 1.933738
H  -0.758554 0.436955 -0.927669
H  -3.853679 0.559314 2.601256
H  -3.979814 -1.16128 2.919932
H  -5.472706 -2.584275 1.597666
H  -5.102884 1.58395 0.702835
H  -7.448506 -2.724404 0.133761
H  -7.069138 1.442677 -0.771036
H  -8.254943 -0.711483 -1.061987
elementType: O C H
totalener: -1079.75387701 hartree
nucrepener: 2024.45113648 hartree
electener: -3104.20501348 hartree
oneelecener: -5488.20801154 hartree
twoeener: 2384.00299806 hartree
cpcmener: -0.02739655 hartree
kineticenergy: 1074.85462406 hartree
xcener: -106.460884259887 hartree
chargesum: 0.0000000
charge: -0.288549 -0.464175 -0.282411 0.125216 0.027107 -0.116510 -0.263210 -0.281742 -0.276221 0.379840 -0.039622 -0.222270 -0.252017 0.107501 -0.034280 -0.346438 -0.057830 0.206280 -0.063816 0.068548 -0.206119 -0.200520 -0.149194 -0.153972 -0.176251 0.090857 0.090909 0.097466 0.096377 0.088124 0.099704 0.092161 0.095455 0.118094 0.087965 0.093484 0.092825 0.096073 0.095185 0.089572 0.112985 0.120078 0.160716 0.169623 0.114557 0.108895 0.139869 0.139296 0.156569 0.156447 0.157373
qa: -0.2885 -0.4642 -0.2824 0.1252 0.0271 -0.1165 -0.2632 -0.2817 -0.2762 0.3798 -0.0396 -0.2223 -0.2520 0.1075 -0.0343 -0.3464 -0.0578 0.2063 -0.0638 0.0685 -0.2061 -0.2005 -0.1492 -0.1540 -0.1763 0.0909 0.0909 0.0975 0.0964 0.0881 0.0997 0.0922 0.0955 0.1181 0.0880 0.0935 0.0928 0.0961 0.0952 0.0896 0.1130 0.1201 0.1607 0.1696 0.1146 0.1089 0.1399 0.1393 0.1566 0.1564 0.1574
va: 2.1213 2.0386 2.2764 3.6986 3.7642 3.8592 3.9045 3.9054 3.8695 4.1936 3.7411 3.9235 3.9439 3.8174 3.6255 4.0183 3.9512 3.6363 3.8246 3.5680 3.9495 3.9618 3.8925 3.8972 3.9046 1.0334 1.0372 1.0026 1.0028 1.0043 0.9995 1.0177 1.0010 1.0092 1.0086 0.9960 0.9963 0.9971 0.9974 1.0095 1.0137 0.9908 1.0055 0.9983 1.0059 1.0095 1.0041 1.0092 0.9908 0.9909 0.9906
dispcorr: -0.021735880 hartree
energy: -1079.775612887102
dipole: 29.49542 -29.21504 0.28038 10.89734 -11.19367 -0.29633 -5.80579 5.16661 -0.63918
magnitude: 0.75828 au
magnitude: 1.92738 debye
