program: Gaussian 09
title: 000069542
version: EM64L-G09RevD.01
frameworkgroup: C1[X(C8H4Cl3F3)]
method: RPBEPBE
basis: SDD
operation: Freq
keyword: #p
keyword: freq=noraman
keyword: PBEPBE/SDD
title: #p freq=noraman PBEPBE/SDD
converged: YES YES NO NO
title: Mulliken charges:
elementType: Cl Cl Cl F F F C C C C C C C C H H H H
charge: 0.086262 0.129597 0.108598 -0.167225 -0.141317 -0.154107 0.569928 0.169600 -0.311974 -0.299078 -0.831826 0.258457 -0.223682 -0.226372 0.259966 0.275615 0.247537 0.250022
chargesum: 0.00000
title: Mulliken charges with hydrogens summed into heavy atoms:
elementType: Cl Cl Cl F F F C C C C C C C C
charge: 0.086262 0.129597 0.108598 -0.167225 -0.141317 -0.154107 0.569928 0.169600 -0.052008 -0.023463 -0.831826 0.258457 0.023855 0.023650
polarizability: 1.29535139e+02 5.60933292e+00 1.32085469e+02 -2.87541743e-01 1.07810108e-02 7.86887854e+01
1716.lowfreq: -9.3312 -0.0019 -0.0017 -0.0016 2.9643 7.5285 44.9982 75.3131 82.8459
frequency: 44.9480 75.2889 82.8208 133.5258 145.0489 177.8244 209.5216 231.5104 249.2381 275.5257 288.3149 331.8004 342.6021 385.4321 397.3099 440.1851 503.5823 517.1119 563.0923 607.4935 616.9773 673.7100 697.3559 725.4268 760.9369 788.2814 846.8439 898.4079 973.9823 978.7784 983.6351 1005.4378 1029.1386 1082.6209 1120.3938 1183.7803 1196.8675 1248.7041 1293.7124 1360.4120 1426.5731 1476.9229 1581.9105 1604.7098 3149.6421 3167.3341 3185.5450 3194.6297
redmass: 13.8906 7.9269 8.6841 10.7294 20.2894 21.0478 12.3463 15.3308 8.8827 19.3662 15.4701 8.2936 6.6477 16.5161 9.7137 7.2413 5.0533 11.5953 4.7103 11.3544 7.7305 6.1264 8.7111 10.2914 2.3847 1.7109 7.5105 1.4492 1.5215 9.1053 6.4497 1.3567 7.0343 2.7633 2.7938 1.8069 1.3447 3.3049 1.4346 11.4651 2.0048 2.4126 6.3679 5.8221 1.0873 1.0931 1.0953 1.0955
irintensity: 0.3355 0.1530 0.1317 0.0502 0.0469 1.4430 1.3022 0.3687 0.7717 0.3137 0.5842 3.9576 2.1445 6.8152 15.8722 0.4089 2.7763 4.6196 3.8584 22.8507 10.4760 165.3923 38.9548 81.6551 86.5227 7.2489 38.3936 8.6490 30.1226 163.0001 144.4861 0.6898 128.0415 43.2322 58.5423 19.4167 6.5908 224.0992 2.9562 12.5068 10.8226 3.8056 2.6567 2.9453 3.1570 7.6082 1.8110 6.9281
temp: 298.150 k
press: 1.00000 atm
elementType: 17 17 17 9 9 9 6 6 6 6 6 6 6 6 1 1 1 1
symmnumber: 1
zpe: 264702.8 jmol-1
zpe.correction: 0.100820 hartree
zpe.thermalcorrener: 0.113943 hartree
zpe.thermalcorrenthalpy: 0.114887 hartree
zpe.thermalcorrgfe: 0.060192 hartree
zpe.sumelectzpe: -1985.917746 hartree
zpe.sumelectthermal: -1985.904623 hartree
zpe.sumelectthermalent: -1985.903679 hartree
zpe.sumelectthermalfe: -1985.958374 hartree
dipole: 1.0890 4.9688 0.0023
dipole: 5.0867
quadrupole: -98.8306 -90.7659 -103.1190
quadrupole: 6.2150 0.0012 0.0830
quadrupole: -1.2588 6.8059 -5.5472 6.2150 0.0012 0.0830
hfenergy: -1986.0185656 hartree
pointgroup: C01 [X(C8H4Cl3F3)]
dipole: -1.9784121 -0.3012729 0.0153321 debye
dipolederiv: -0.2025574 -0.0733611 -0.0231007 -0.1134474 -0.7062723 -0.1068714 -0.0326976 -0.0829586 -0.1795029 -0.4548284 -0.0572982 0.293143 -0.0713507 -0.1716996 0.1128843 0.2712222 0.1332968 -0.4293565 -0.3536093 0.0765808 -0.239708 0.0552854 -0.1585465 -0.0152505 -0.2885291 -0.0132623 -0.699869 -0.3664395 -0.0135232 0.0429504 0.0345647 -0.8055694 -0.1667974 0.0611547 -0.1444691 -0.3351775 -0.6592224 0.0195967 -0.2185236 0.0108928 -0.4084225 0.0447029 -0.1801619 0.0732019 -0.3835177 -0.4448974 -0.1509157 0.1642852 -0.1549437 -0.4315515 0.1292155 0.1922493 0.1294662 -0.6904235 -0.148047 -0.0415154 0.0081926 0.1904659 -0.1550372 0.0016884 0.0867014 -0.0549018 -0.1492551 -0.2266542 -0.0719977 0.0028429 -0.2561122 -0.1111338 0.0035417 -0.0551177 -0.0495443 -0.1251009 -0.2046347 -0.0503341 -0.0018444 0.0904127 -0.0148927 -0.0240451 0.0020799 -0.0039607 -0.0981959 -0.1565773 0.1002442 -0.0119035 -0.0381256 0.0196591 -0.0171601 0.0055715 0.0108492 -0.0850863 1.1727368 -0.0170085 -0.0256155 0.0102113 1.2253277 0.0090733 -0.0241646 0.0081413 1.3879405 1.579097 0.2781 0.0072505 0.2177958 1.6631055 -0.0069703 -0.0309485 -0.0311283 1.4047972 0.1576915 0.1280543 -0.0037249 0.0527015 -0.0014812 -0.0034263 -0.0171665 0.0001716 -0.1008998 0.1328636 -0.1355303 0.010703 -0.0155961 -0.0617209 0.0006364 0.0102818 -0.0021894 -0.1262057 0.1475331 -0.0093304 -0.001913 -0.0264047 0.0158347 0.0120345 0.0021177 0.0072588 0.1417786 0.1109244 0.0161293 0.0002956 0.0164559 0.0054215 0.013482 -0.0014062 0.0089091 0.1556626 -0.0411459 -0.0636822 0.0042782 -0.0813737 0.0422385 0.0063692 0.0062303 0.0055676 0.1555059 -0.042233 0.0657914 -0.0076076 0.0785681 0.0547406 0.006893 -0.0074169 0.0055519 0.156906 unknown
polarizability: 135.5141423|-3.2895889|125.8865658|0.4249295|-3.2286478|78.9086849 unknown
InChI: InChI=1S/C8H4Cl3F3/c9-7(10,11)5-3-1-2-4-6(5)8(12,13)14/h1-4H
charge 0 multiplicity 1
18 atoms
Cl 0.660048 -3.406396 -0.201733
Cl 2.185905 -1.050191 -1.176583
Cl 1.692684 -1.443668 1.813369
F  0.38048 2.939167 0.403276
F  1.875105 1.286177 0.663149
F  1.199435 1.894739 -1.41989
C  -0.359621 -0.744944 0.03179
C  -0.423123 0.690832 -0.037294
C  -1.589396 -1.45219 0.077654
C  -1.687505 1.329543 -0.097674
C  0.933551 -1.560856 0.103456
C  0.751731 1.65607 -0.091135
C  -2.837869 -0.801315 0.028314
C  -2.891489 0.600806 -0.068576
H  -1.567194 -2.540825 0.146715
H  -1.722018 2.420275 -0.153022
H  -3.756233 -1.395759 0.063785
H  -3.84979 1.126535 -0.117101
