program: Orca
programVersion: 5.0.2
elementType: O O O C C C C C C C C C C C C C C C C C C C C C C H H H H H H H H H H H H H H H H H H H H H H H H H H
charge: 0
multiplicity: 1
keywords: wb97x-d3
keywords: def2-TZVPP
keywords: def2/J RIJCOSX
keywords: DEFGRID2
keywords: scfconv7
keywords: smallprint printgap noloewdin
keywords: NOSOSCF
formula: C22H26O3
InChI: InChI=1/C22H26O3/c1-15(2)10-19-20(22(19,3)4)21(23)25-14-17-12-18(24-13-17)11-16-8-6-5-7-9-16/h5-10,12-13,19-20H,11,14H2,1-4H3
51 atoms
O  1.469839 -1.783601 0.329301
O  1.420058 -1.164058 -1.820824
O  -2.817748 -2.488168 1.148211
C  2.128534 1.620944 -0.564488
C  3.35834 1.017074 -1.172261
C  2.52864 0.201107 -0.19814
C  2.259521 2.643508 0.539102
C  0.939541 1.880112 -1.457287
C  4.718505 1.437245 -0.786649
C  1.759392 -0.961964 -0.677584
C  5.768425 1.598394 -1.599182
C  7.087396 2.065012 -1.059014
C  5.754367 1.365914 -3.079634
C  0.645561 -2.93219 0.070931
C  -0.792141 -2.598428 0.248027
C  -1.62852 -1.775469 -0.577634
C  -1.57554 -2.994939 1.277627
C  -2.843112 -1.742307 0.018447
C  -4.108021 -1.030024 -0.295496
C  -4.434311 0.002946 0.757108
C  -5.410343 -0.238377 1.717881
C  -3.726211 1.201678 0.805288
C  -5.677057 0.699294 2.708003
C  -3.990156 2.139902 1.791763
C  -4.966758 1.890328 2.748665
H  3.23222 0.721084 -2.207895
H  2.933538 0.090235 0.801843
H  3.044081 2.403217 1.255189
H  1.324033 2.719523 1.097119
H  2.476795 3.630448 0.124897
H  0.975006 2.909707 -1.819491
H  0.002021 1.759835 -0.909183
H  0.904023 1.231938 -2.329969
H  4.870821 1.641795 0.269141
H  7.870981 1.322927 -1.234818
H  7.413527 2.980816 -1.559937
H  7.048815 2.265369 0.011927
H  5.856729 2.311837 -3.618656
H  6.60534 0.749644 -3.379296
H  4.852196 0.878292 -3.443402
H  0.953512 -3.676591 0.804244
H  0.851295 -3.335238 -0.9211
H  -1.359397 -1.272898 -1.492996
H  -1.389579 -3.620411 2.137417
H  -4.932735 -1.742306 -0.38661
H  -3.990734 -0.555569 -1.271222
H  -5.968695 -1.166919 1.693294
H  -2.959269 1.401007 0.065105
H  -6.440832 0.4965 3.448153
H  -3.433027 3.068033 1.814638
H  -5.173853 2.622212 3.518929
elementType: O C H
totalener: -1079.75512585 hartree
nucrepener: 2080.68984643 hartree
electener: -3160.44497228 hartree
oneelecener: -5600.53670910 hartree
twoeener: 2440.09173682 hartree
cpcmener: -0.02531343 hartree
kineticenergy: 1074.85766113 hartree
xcener: -106.460714105853 hartree
chargesum: 0.0000000
charge: -0.281431 -0.478020 -0.278127 0.109341 0.031653 -0.091067 -0.275568 -0.282367 -0.273195 0.409544 -0.049607 -0.216925 -0.255261 0.072882 -0.082808 -0.307235 -0.035820 0.193044 -0.059535 0.040477 -0.179735 -0.191782 -0.159365 -0.166443 -0.164946 0.095049 0.088417 0.088694 0.096938 0.097456 0.097703 0.094506 0.093633 0.115267 0.093318 0.091773 0.087034 0.099092 0.092239 0.091444 0.115022 0.118642 0.161874 0.173888 0.108721 0.115813 0.138342 0.148532 0.155966 0.155916 0.157015
qa: -0.2814 -0.4780 -0.2781 0.1093 0.0317 -0.0911 -0.2756 -0.2824 -0.2732 0.4095 -0.0496 -0.2169 -0.2553 0.0729 -0.0828 -0.3072 -0.0358 0.1930 -0.0595 0.0405 -0.1797 -0.1918 -0.1594 -0.1664 -0.1649 0.0950 0.0884 0.0887 0.0969 0.0975 0.0977 0.0945 0.0936 0.1153 0.0933 0.0918 0.0870 0.0991 0.0922 0.0914 0.1150 0.1186 0.1619 0.1739 0.1087 0.1158 0.1383 0.1485 0.1560 0.1559 0.1570
va: 2.1225 2.0264 2.2802 3.6773 3.7898 3.8291 3.9108 3.9066 3.8818 4.1705 3.7657 3.9214 3.9394 3.8494 3.6925 3.9933 3.9705 3.6654 3.8186 3.5885 3.9477 3.9328 3.9000 3.9171 3.8977 1.0265 1.0355 1.0074 1.0012 1.0013 1.0012 0.9993 1.0187 1.0119 0.9966 0.9954 1.0093 0.9958 0.9977 1.0107 0.9982 1.0099 1.0166 0.9946 1.0065 1.0074 1.0049 0.9978 0.9911 0.9919 0.9904
dispcorr: -0.022527469 hartree
energy: -1079.777653317345
dipole: 23.95447 -23.70573 0.24874 18.60274 -18.23953 0.36321 -7.18133 7.70473 0.52340
magnitude: 0.68391 au
magnitude: 1.73837 debye
