program: Orca
programVersion: 5.0.2
elementType: O O O C C C C C C C C C C C C C C C C C C C C C C H H H H H H H H H H H H H H H H H H H H H H H H H H
charge: 0
multiplicity: 1
keywords: wb97x-d3
keywords: def2-TZVPP
keywords: def2/J RIJCOSX
keywords: DEFGRID2
keywords: scfconv7
keywords: smallprint printgap noloewdin
keywords: NOSOSCF
formula: C22H26O3
InChI: InChI=1/C22H26O3/c1-15(2)10-19-20(22(19,3)4)21(23)25-14-17-12-18(24-13-17)11-16-8-6-5-7-9-16/h5-10,12-13,19-20H,11,14H2,1-4H3
51 atoms
O  1.873571 -2.278976 0.356257
O  1.449562 -1.620327 -1.73783
O  -2.437404 -2.720368 -0.320899
C  1.376225 1.116814 -0.121025
C  2.509118 1.081606 -1.107225
C  2.337361 -0.06531 -0.150702
C  1.48052 2.024838 1.078572
C  -0.036238 0.973282 -0.632793
C  3.68859 1.972419 -0.980552
C  1.851742 -1.375865 -0.625359
C  3.902682 3.070281 -1.711439
C  5.136092 3.900714 -1.524902
C  2.952583 3.570683 -2.755796
C  1.109368 -3.481368 0.165516
C  -0.33917 -3.157488 0.245918
C  -1.025492 -2.610258 1.378206
C  -1.24985 -3.191378 -0.753594
C  -2.292781 -2.358102 0.975895
C  -3.445245 -1.689103 1.637184
C  -3.411461 -0.197856 1.393134
C  -2.833014 0.654817 2.329153
C  -3.899604 0.342172 0.206104
C  -2.744522 2.019177 2.087411
C  -3.811695 1.705897 -0.038537
C  -3.233041 2.549093 0.901189
H  2.19872 0.864316 -2.12517
H  3.018308 -0.112285 0.693491
H  1.174915 3.040242 0.815888
H  2.492093 2.079499 1.480136
H  0.823453 1.680256 1.879879
H  -0.683029 0.513079 0.118022
H  -0.106663 0.381652 -1.543429
H  -0.445489 1.960596 -0.856595
H  4.428371 1.701823 -0.232165
H  5.711339 3.965823 -2.452579
H  4.881285 4.927615 -1.249019
H  5.791503 3.498432 -0.752146
H  3.438505 3.624763 -3.733751
H  2.059846 2.956321 -2.859436
H  2.626161 4.587249 -2.520075
H  1.421276 -4.135389 0.978718
H  1.364503 -3.969661 -0.776114
H  -0.617915 -2.416504 2.358581
H  -1.199293 -3.518019 -1.780693
H  -3.396394 -1.890658 2.708049
H  -4.384288 -2.114632 1.275608
H  -2.446393 0.248263 3.25667
H  -4.354893 -0.306138 -0.53372
H  -2.294024 2.668287 2.827828
H  -4.198247 2.111259 -0.965123
H  -3.165521 3.612666 0.711065
elementType: O C H
totalener: -1079.75219418 hartree
nucrepener: 2195.79859864 hartree
electener: -3275.55079282 hartree
oneelecener: -5831.15168933 hartree
twoeener: 2555.60089651 hartree
cpcmener: -0.02531957 hartree
kineticenergy: 1074.86241075 hartree
xcener: -106.461786568466 hartree
chargesum: -0.0000000
charge: -0.284450 -0.456561 -0.273362 0.214252 -0.019681 -0.120771 -0.281444 -0.294723 -0.269625 0.368085 -0.029463 -0.228616 -0.250788 0.093384 -0.056629 -0.351796 -0.030648 0.215005 -0.062406 0.039882 -0.169208 -0.186738 -0.168891 -0.154826 -0.171212 0.095954 0.092960 0.096996 0.094264 0.094214 0.048790 0.101529 0.104589 0.118621 0.093891 0.092659 0.088751 0.097799 0.087433 0.095000 0.120433 0.115570 0.157162 0.172154 0.107924 0.112828 0.136364 0.137677 0.156373 0.155020 0.156277
qa: -0.2845 -0.4566 -0.2734 0.2143 -0.0197 -0.1208 -0.2814 -0.2947 -0.2696 0.3681 -0.0295 -0.2286 -0.2508 0.0934 -0.0566 -0.3518 -0.0306 0.2150 -0.0624 0.0399 -0.1692 -0.1867 -0.1689 -0.1548 -0.1712 0.0960 0.0930 0.0970 0.0943 0.0942 0.0488 0.1015 0.1046 0.1186 0.0939 0.0927 0.0888 0.0978 0.0874 0.0950 0.1204 0.1156 0.1572 0.1722 0.1079 0.1128 0.1364 0.1377 0.1564 0.1550 0.1563
va: 2.1058 2.0498 2.2716 3.5995 3.8099 3.8692 3.9047 3.9036 3.8701 4.2504 3.7076 3.9282 3.9420 3.8416 3.6349 3.9694 3.9539 3.6034 3.8168 3.6050 3.8813 3.9277 3.8649 3.8875 3.8604 1.0263 1.0361 1.0021 1.0045 1.0044 1.0106 1.0240 1.0005 1.0080 0.9954 0.9963 1.0079 0.9982 1.0090 0.9977 0.9915 1.0088 1.0114 0.9989 1.0110 1.0128 1.0044 1.0106 0.9915 0.9917 0.9915
dispcorr: -0.027447541 hartree
energy: -1079.779641722406
dipole: 12.94024 -13.00387 -0.06363 24.06875 -23.56807 0.50068 -2.62493 3.74219 1.11726
magnitude: 1.22597 au
magnitude: 3.11616 debye
