program: Orca
programVersion: 5.0.2
elementType: O O O C C C C C C C C C C C C C C C C C C C C C C H H H H H H H H H H H H H H H H H H H H H H H H H H
charge: 0
multiplicity: 1
keywords: wb97x-d3
keywords: def2-TZVPP
keywords: def2/J RIJCOSX
keywords: DEFGRID2
keywords: scfconv7
keywords: smallprint printgap noloewdin
keywords: NOSOSCF
formula: C22H26O3
InChI: InChI=1/C22H26O3/c1-15(2)10-19-20(22(19,3)4)21(23)25-14-17-12-18(24-13-17)11-16-8-6-5-7-9-16/h5-10,12-13,19-20H,11,14H2,1-4H3
51 atoms
O  0.928862 -1.44802 -1.222603
O  2.201021 -1.642342 0.606056
O  -1.909061 -2.24654 2.130568
C  4.055981 0.181598 -1.221758
C  3.504252 0.959495 -0.061941
C  2.564139 0.159759 -0.931087
C  4.474073 0.922114 -2.468599
C  4.909449 -1.029013 -0.93503
C  3.424919 2.438157 -0.079315
C  1.905383 -1.053738 -0.407162
C  4.112117 3.269388 0.710152
C  3.950773 4.75505 0.591522
C  5.094495 2.826779 1.750738
C  0.168377 -2.609848 -0.85796
C  -0.838284 -2.304757 0.191629
C  -2.017318 -1.500731 0.050172
C  -0.830702 -2.724639 1.477002
C  -2.628322 -1.499793 1.258847
C  -3.865933 -0.859292 1.78522
C  -4.628791 -0.161798 0.693194
C  -5.680992 -0.799929 0.043586
C  -4.269895 1.121423 0.28896
C  -6.361368 -0.170532 -0.990562
C  -4.945353 1.752141 -0.74658
C  -5.993296 1.106571 -1.390347
H  3.70824 0.510375 0.905081
H  1.960513 0.723102 -1.635432
H  3.810815 1.752202 -2.709926
H  4.484844 0.249704 -3.329015
H  5.481825 1.32755 -2.35327
H  5.961087 -0.735344 -0.903661
H  4.804708 -1.782001 -1.719718
H  4.679653 -1.501691 0.017866
H  2.752914 2.875758 -0.812592
H  4.903217 5.235403 0.350542
H  3.231227 5.032781 -0.178937
H  3.616863 5.192526 1.536439
H  6.08706 3.231572 1.534465
H  4.816807 3.209659 2.736424
H  5.193014 1.74543 1.828652
H  0.828324 -3.422249 -0.549523
H  -0.320432 -2.912155 -1.78366
H  -2.354358 -0.997469 -0.842763
H  -0.151604 -3.344913 2.041957
H  -3.601293 -0.145567 2.572701
H  -4.497893 -1.617147 2.258043
H  -5.972509 -1.798126 0.349472
H  -3.452207 1.630321 0.786815
H  -7.181943 -0.678191 -1.481973
H  -4.654042 2.749782 -1.050297
H  -6.523198 1.59861 -2.196101
elementType: O C H
totalener: -1079.75486165 hartree
nucrepener: 2055.23491095 hartree
electener: -3134.98977260 hartree
oneelecener: -5549.76588403 hartree
twoeener: 2414.77611143 hartree
cpcmener: -0.02495808 hartree
kineticenergy: 1074.84606014 hartree
xcener: -106.458730914202 hartree
chargesum: -0.0000000
charge: -0.283188 -0.474172 -0.280116 0.133098 0.017044 -0.132475 -0.261913 -0.286285 -0.273799 0.412063 -0.034511 -0.225648 -0.251961 0.087305 -0.100505 -0.300662 -0.019647 0.172956 0.000983 0.003913 -0.188556 -0.197423 -0.152663 -0.152602 -0.165418 0.091833 0.087409 0.087809 0.097490 0.095788 0.095140 0.099802 0.092693 0.118766 0.092876 0.088272 0.093767 0.095400 0.095516 0.089456 0.117378 0.122003 0.160518 0.172914 0.107677 0.102590 0.138653 0.140948 0.155908 0.156189 0.157392
qa: -0.2832 -0.4742 -0.2801 0.1331 0.0170 -0.1325 -0.2619 -0.2863 -0.2738 0.4121 -0.0345 -0.2256 -0.2520 0.0873 -0.1005 -0.3007 -0.0196 0.1730 0.0010 0.0039 -0.1886 -0.1974 -0.1527 -0.1526 -0.1654 0.0918 0.0874 0.0878 0.0975 0.0958 0.0951 0.0998 0.0927 0.1188 0.0929 0.0883 0.0938 0.0954 0.0955 0.0895 0.1174 0.1220 0.1605 0.1729 0.1077 0.1026 0.1387 0.1409 0.1559 0.1562 0.1574
va: 2.1184 2.0349 2.2764 3.6851 3.7665 3.8757 3.9051 3.9050 3.8743 4.1771 3.7260 3.9248 3.9436 3.8331 3.6753 3.9821 3.9598 3.6918 3.8230 3.6276 3.9363 3.9252 3.8972 3.8948 3.8933 1.0317 1.0392 1.0042 1.0026 1.0032 1.0010 0.9991 1.0185 1.0086 0.9964 1.0084 0.9958 0.9972 0.9976 1.0090 1.0092 0.9904 1.0039 0.9997 1.0035 1.0097 1.0043 1.0038 0.9912 0.9912 0.9904
dispcorr: -0.022025533 hartree
energy: -1079.776887181727
dipole: 25.88177 -25.99952 -0.11775 17.63171 -17.07670 0.55501 -4.64853 3.79950 -0.84904
magnitude: 1.02116 au
magnitude: 2.59557 debye
