program: Orca
programVersion: 5.0.2
elementType: O O O C C C C C C C C C C C C C C C C C C C C C C H H H H H H H H H H H H H H H H H H H H H H H H H H
charge: 0
multiplicity: 1
keywords: wb97x-d3
keywords: def2-TZVPP
keywords: def2/J RIJCOSX
keywords: DEFGRID2
keywords: scfconv7
keywords: smallprint printgap noloewdin
keywords: NOSOSCF
formula: C22H26O3
InChI: InChI=1/C22H26O3/c1-15(2)10-19-20(22(19,3)4)21(23)25-14-17-12-18(24-13-17)11-16-8-6-5-7-9-16/h5-10,12-13,19-20H,11,14H2,1-4H3
51 atoms
O  1.360848 -1.53518 -1.436623
O  2.573771 -2.215053 0.314251
O  -1.478838 -1.716036 1.874932
C  4.58378 0.034842 -0.561855
C  3.629161 0.587116 0.43681
C  3.092542 -0.151027 -0.783477
C  5.25353 0.980031 -1.530555
C  5.45919 -1.132488 -0.176389
C  3.342303 2.035315 0.594504
C  2.359192 -1.407028 -0.559999
C  2.141477 2.523531 0.918019
C  1.905333 3.995096 1.061088
C  0.936303 1.652923 1.124602
C  0.368322 -2.540496 -1.173915
C  -0.557796 -2.070179 -0.110002
C  -1.596947 -1.091353 -0.243906
C  -0.534051 -2.402955 1.201311
C  -2.121978 -0.915463 0.991872
C  -3.193753 -0.035398 1.534568
C  -4.100353 0.472076 0.446119
C  -5.121557 -0.337532 -0.045744
C  -3.92677 1.738493 -0.102173
C  -5.956994 0.111668 -1.057073
C  -4.761438 2.191661 -1.116801
C  -5.779238 1.380047 -1.595936
H  3.555516 0.002205 1.350948
H  2.665989 0.478968 -1.555637
H  6.142353 1.427427 -1.080099
H  4.59872 1.791688 -1.848835
H  5.573446 0.446111 -2.427599
H  5.664751 -1.771257 -1.037354
H  5.026882 -1.751353 0.605395
H  6.418294 -0.764389 0.19254
H  4.167525 2.726776 0.447783
H  1.568595 4.243421 2.071028
H  2.801804 4.578809 0.851346
H  1.117053 4.332707 0.382481
H  0.311931 2.035676 1.93422
H  0.308816 1.641917 0.22867
H  1.187227 0.620025 1.361353
H  0.831729 -3.493013 -0.915324
H  -0.153622 -2.667644 -2.121176
H  -1.905769 -0.594086 -1.150315
H  0.067893 -3.092127 1.772548
H  -2.745216 0.807971 2.069619
H  -3.77599 -0.591591 2.274674
H  -5.266663 -1.327596 0.371174
H  -3.135425 2.379292 0.269603
H  -6.750283 -0.527471 -1.423687
H  -4.616606 3.18148 -1.530984
H  -6.432625 1.733319 -2.383391
elementType: O C H
totalener: -1079.75194828 hartree
nucrepener: 2143.59697553 hartree
electener: -3223.34892380 hartree
oneelecener: -5726.25231636 hartree
twoeener: 2502.90339256 hartree
cpcmener: -0.02303685 hartree
kineticenergy: 1074.86145853 hartree
xcener: -106.461185340092 hartree
chargesum: -0.0000000
charge: -0.288397 -0.474099 -0.280675 0.162424 -0.016652 -0.075360 -0.286099 -0.281737 -0.311687 0.351542 0.020482 -0.229816 -0.269285 0.094136 -0.075496 -0.350986 -0.014761 0.195022 -0.004266 0.007975 -0.197093 -0.182759 -0.149176 -0.158757 -0.166105 0.101352 0.088749 0.098336 0.092023 0.097213 0.098380 0.092717 0.091930 0.121161 0.095847 0.088386 0.095346 0.103478 0.105287 0.086492 0.115403 0.118544 0.158010 0.169758 0.101811 0.109808 0.140069 0.140416 0.156899 0.156553 0.157655
qa: -0.2884 -0.4741 -0.2807 0.1624 -0.0167 -0.0754 -0.2861 -0.2817 -0.3117 0.3515 0.0205 -0.2298 -0.2693 0.0941 -0.0755 -0.3510 -0.0148 0.1950 -0.0043 0.0080 -0.1971 -0.1828 -0.1492 -0.1588 -0.1661 0.1014 0.0887 0.0983 0.0920 0.0972 0.0984 0.0927 0.0919 0.1212 0.0958 0.0884 0.0953 0.1035 0.1053 0.0865 0.1154 0.1185 0.1580 0.1698 0.1018 0.1098 0.1401 0.1404 0.1569 0.1566 0.1577
va: 2.1014 2.0244 2.2674 3.6991 3.8151 3.7937 3.9092 3.8845 3.9036 4.2006 3.6953 3.9338 3.9517 3.8279 3.6553 3.9492 3.9435 3.6162 3.8037 3.6212 3.9381 3.9197 3.8922 3.9059 3.8943 1.0262 1.0349 0.9994 1.0017 1.0031 0.9993 1.0205 1.0012 1.0044 0.9961 1.0066 0.9952 1.0015 0.9958 1.0026 1.0128 0.9926 1.0065 1.0040 1.0040 1.0095 1.0033 1.0040 0.9906 0.9911 0.9902
dispcorr: -0.025397695 hartree
energy: -1079.777345971755
dipole: 16.07874 -16.64616 -0.56742 15.07495 -14.12255 0.95240 -1.32596 0.71849 -0.60747
magnitude: 1.26414 au
magnitude: 3.21318 debye
