program: Orca
programVersion: 5.0.2
elementType: O O O C C C C C C C C C C C C C C C C C C C C C C H H H H H H H H H H H H H H H H H H H H H H H H H H
charge: 0
multiplicity: 1
keywords: wb97x-d3
keywords: def2-TZVPP
keywords: def2/J RIJCOSX
keywords: DEFGRID2
keywords: scfconv7
keywords: smallprint printgap noloewdin
keywords: NOSOSCF
formula: C22H26O3
InChI: InChI=1/C22H26O3/c1-15(2)10-19-20(22(19,3)4)21(23)25-14-17-12-18(24-13-17)11-16-8-6-5-7-9-16/h5-10,12-13,19-20H,11,14H2,1-4H3
51 atoms
O  1.542384 -1.699833 0.436632
O  1.414857 -1.190232 -1.736039
O  -2.758785 -2.09883 -0.379631
C  2.15404 1.671653 -0.692292
C  3.38197 1.016876 -1.247625
C  2.54381 0.279795 -0.222184
C  2.304578 2.773908 0.328085
C  0.972381 1.880207 -1.607523
C  4.744661 1.456209 -0.880541
C  1.781864 -0.919955 -0.615899
C  5.704886 1.851157 -1.722934
C  7.047117 2.278017 -1.208819
C  5.558143 1.921308 -3.212092
C  0.765934 -2.891232 0.227828
C  -0.692269 -2.598641 0.252883
C  -1.528666 -2.502857 1.412088
C  -1.500996 -2.339283 -0.80197
C  -2.771711 -2.201724 0.970443
C  -4.058367 -1.949152 1.666931
C  -4.463611 -0.495298 1.610218
C  -3.814056 0.443532 2.408706
C  -5.468568 -0.064068 0.751885
C  -4.167538 1.783279 2.356425
C  -5.824664 1.278123 0.696148
C  -5.175303 2.205523 1.497557
H  3.262371 0.649518 -2.261586
H  2.949824 0.243825 0.783085
H  1.37494 2.907243 0.885151
H  2.531739 3.722126 -0.164763
H  3.095053 2.58034 1.052799
H  0.929807 1.167483 -2.428067
H  1.028995 2.877995 -2.048074
H  0.030165 1.818732 -1.058358
H  4.974183 1.46269 0.181389
H  7.844865 1.658574 -1.628018
H  7.271228 3.307302 -1.502438
H  7.112338 2.217859 -0.122247
H  6.314243 1.30453 -3.70523
H  4.582524 1.603788 -3.574911
H  5.721338 2.943785 -3.563476
H  1.037778 -3.545102 1.055185
H  1.061393 -3.384948 -0.698404
H  -1.237289 -2.648765 2.440873
H  -1.33257 -2.303315 -1.866907
H  -3.94084 -2.264493 2.705158
H  -4.847266 -2.572028 1.236903
H  -3.025623 0.122651 3.080395
H  -5.983238 -0.782495 0.124577
H  -3.65726 2.499119 2.988602
H  -6.612123 1.597995 0.025465
H  -5.454117 3.250765 1.45729
elementType: O C H
totalener: -1079.75501364 hartree
nucrepener: 2069.65872671 hartree
electener: -3149.41374035 hartree
oneelecener: -5578.74424111 hartree
twoeener: 2429.33050077 hartree
cpcmener: -0.02521434 hartree
kineticenergy: 1074.86043907 hartree
xcener: -106.460184679494 hartree
chargesum: -0.0000000
charge: -0.284893 -0.477338 -0.277282 0.123940 0.032903 -0.119491 -0.265414 -0.283958 -0.277021 0.404867 -0.042690 -0.220586 -0.251093 0.089523 -0.087721 -0.327593 -0.013298 0.200028 -0.063681 0.045949 -0.192745 -0.189385 -0.160098 -0.155366 -0.169929 0.092623 0.087096 0.097773 0.095905 0.087091 0.093104 0.094982 0.098701 0.117777 0.093279 0.092584 0.087764 0.095225 0.088743 0.095862 0.117916 0.118850 0.160995 0.169135 0.117119 0.109049 0.141356 0.139005 0.156851 0.156076 0.157513
qa: -0.2849 -0.4773 -0.2773 0.1239 0.0329 -0.1195 -0.2654 -0.2840 -0.2770 0.4049 -0.0427 -0.2206 -0.2511 0.0895 -0.0877 -0.3276 -0.0133 0.2000 -0.0637 0.0459 -0.1927 -0.1894 -0.1601 -0.1554 -0.1699 0.0926 0.0871 0.0978 0.0959 0.0871 0.0931 0.0950 0.0987 0.1178 0.0933 0.0926 0.0878 0.0952 0.0887 0.0959 0.1179 0.1189 0.1610 0.1691 0.1171 0.1090 0.1414 0.1390 0.1569 0.1561 0.1575
va: 2.1269 2.0270 2.2819 3.6763 3.7677 3.8857 3.9067 3.9044 3.8697 4.1689 3.7492 3.9223 3.9434 3.8144 3.6356 4.0170 3.9469 3.6308 3.8196 3.5896 3.9415 3.9544 3.9084 3.8974 3.9003 1.0316 1.0381 1.0023 1.0028 1.0056 1.0196 1.0005 0.9995 1.0098 0.9961 0.9964 1.0089 0.9971 1.0098 0.9972 0.9949 1.0118 1.0066 1.0057 1.0063 1.0086 1.0037 1.0050 0.9912 0.9912 0.9905
dispcorr: -0.021987434 hartree
energy: -1079.777001070383
dipole: 23.61026 -23.32970 0.28057 19.14397 -18.89822 0.24576 -5.50783 6.50567 0.99784
magnitude: 1.06527 au
magnitude: 2.70770 debye
