program: Gaussian 09
title: 000069532
version: EM64L-G09RevD.01
frameworkgroup: C1[X(C10H22N4O2S2)]
method: RPBEPBE
basis: SDD
operation: Freq
keyword: #p
keyword: freq=noraman
keyword: PBEPBE/SDD
title: #p freq=noraman PBEPBE/SDD
converged: YES YES NO NO
title: Mulliken charges:
elementType: S S O O N N N N C C C C C C C C C C H H H H H H H H H H H H H H H H H H H H H H
charge: 0.013569 0.013720 -0.279984 -0.279953 -0.362692 -0.362653 -0.574334 -0.574361 -0.326119 -0.326350 -0.492688 -0.492679 -0.668595 -0.668469 0.255187 0.255180 -0.386364 -0.386371 0.269246 0.247134 0.269212 0.247154 0.259668 0.195849 0.195874 0.259689 0.290744 0.271419 0.290821 0.271403 0.306469 0.306477 0.191267 0.250038 0.191290 0.250015 0.259735 0.280348 0.259745 0.280359
chargesum: 0.00000
title: Mulliken charges with hydrogens summed into heavy atoms:
elementType: S S O O N N N N C C C C C C C C C C
charge: 0.013569 0.013720 -0.279984 -0.279953 -0.056223 -0.056176 -0.034251 -0.034258 0.190261 0.190015 -0.037171 -0.037116 -0.106431 -0.106246 0.255187 0.255180 0.054942 0.054934
polarizability: 2.74874496e+02 2.86977405e-04 1.60384223e+02 -1.14067637e+01 3.37623626e-02 1.31212594e+02
1716.lowfreq: -11.3419 -0.0020 0.0016 0.0021 3.4959 3.6948 12.2097 13.4054 22.4856
frequency: 5.7797 13.4037 22.4412 23.9973 34.8932 42.6887 44.1159 51.8108 68.6535 80.3825 86.5404 108.0725 110.7899 144.6997 171.0372 188.1119 204.3554 216.0131 216.5230 258.6919 261.6109 315.4122 318.0397 355.1858 356.0794 404.1030 411.1186 415.1783 468.4209 473.1683 575.6173 576.0878 579.4557 581.9374 594.0228 594.1994 621.0146 622.1527 698.6101 699.1338 792.1607 792.2241 805.5432 808.1972 903.9970 906.2433 950.7406 951.8127 983.1526 984.9789 1020.9557 1024.3562 1042.4919 1042.7591 1086.0664 1086.3780 1103.5325 1104.0128 1138.9378 1139.2957 1171.2404 1173.0086 1210.4209 1212.4390 1231.3258 1232.3064 1233.2623 1239.3439 1286.3506 1291.3343 1296.1691 1296.1880 1330.8220 1330.9624 1362.2929 1362.9952 1383.6087 1383.6463 1413.3075 1414.0415 1444.4748 1444.5493 1450.7042 1452.2860 1483.2389 1486.8038 1488.5716 1488.6782 1614.3727 1615.0540 1643.3792 1643.4034 2895.7925 2895.8451 2979.3774 2979.4279 2991.8476 2992.0874 3019.5125 3020.5215 3040.6448 3040.6491 3060.3112 3060.5285 3068.9207 3068.9449 3101.7962 3103.0541 3464.8303 3464.9090 3542.0066 3542.2691 3591.7766 3591.8511
redmass: 5.8274 6.0685 4.2004 4.4210 4.8054 5.7147 6.7363 3.3731 2.7378 3.7045 2.4367 3.7782 3.7879 2.9383 3.2492 2.7929 4.7333 1.2782 1.2667 3.8893 5.3410 2.9262 2.8805 3.0129 2.8325 7.1107 3.2143 4.0773 2.5522 2.5552 3.1963 2.3047 2.1931 1.9097 1.3575 1.3717 1.7669 1.8209 3.9648 4.0149 1.3405 1.3364 1.8711 1.9044 2.7811 2.8274 1.7679 1.7867 2.3151 2.3351 1.8303 1.8566 2.5543 2.5259 1.9810 1.9627 3.5456 3.5408 1.7178 1.7293 1.1971 1.1979 1.4278 1.4930 1.4007 1.3854 1.5176 1.4400 1.1586 1.1703 1.1214 1.1216 1.4594 1.4613 1.3391 1.3376 1.4407 1.4410 1.0962 1.0953 1.0984 1.0982 1.1337 1.1141 1.8401 1.8887 1.0845 1.0847 6.0505 6.1552 1.0982 1.0981 1.0721 1.0721 1.0614 1.0614 1.0614 1.0614 1.0585 1.0588 1.0954 1.0954 1.1001 1.1001 1.0929 1.0929 1.1068 1.1059 1.0451 1.0451 1.0775 1.0775 1.0977 1.0977
irintensity: 3.3912 0.5944 3.0863 0.1652 3.4609 0.5962 11.8782 0.5453 2.2057 1.1319 2.9558 0.4512 2.2763 7.9897 15.3206 4.0695 5.0388 88.4790 0.1196 50.3977 1.2642 0.2556 6.7475 4.9475 42.0475 0.1195 1.6246 0.6580 1.0736 3.9063 41.2006 232.3740 51.9854 63.2610 79.4496 78.5593 34.1757 152.5221 5.0761 0.8098 12.3367 5.9533 58.6833 0.8058 2.6418 1.1034 0.0609 1.9768 30.5309 1.4466 0.0151 24.1769 4.9334 4.6042 11.8783 0.1303 73.6052 21.3404 7.5239 1.1223 32.9940 0.2743 3.6185 3.2668 84.0749 0.1572 200.5646 26.0149 4.4926 23.0552 10.9129 9.0253 26.5499 16.7563 7.7850 4.8127 19.4524 34.1248 17.9560 9.7771 16.2734 22.9108 152.8018 3.1077 584.0359 38.9434 5.7125 4.6355 226.8476 117.8019 39.4476 38.7517 92.1102 98.5588 26.4643 23.1917 39.2640 15.2363 18.7150 3.9268 2.0934 15.1238 6.9907 10.2736 32.2288 22.2208 13.8442 7.3048 0.8232 0.8198 35.3578 18.1735 0.7424 0.7417
temp: 298.150 k
press: 1.00000 atm
elementType: 16 16 8 8 7 7 7 7 6 6 6 6 6 6 6 6 6 6 1 1 1 1 1 1 1 1 1 1 1 1 1 1 1 1 1 1 1 1 1 1
symmnumber: 1
zpe: 869140.1 jmol-1
zpe.correction: 0.331038 hartree
zpe.thermalcorrener: 0.354669 hartree
zpe.thermalcorrenthalpy: 0.355613 hartree
zpe.thermalcorrgfe: 0.270207 hartree
zpe.sumelectzpe: -1558.393346 hartree
zpe.sumelectthermal: -1558.369715 hartree
zpe.sumelectthermalent: -1558.368771 hartree
zpe.sumelectthermalfe: -1558.454177 hartree
dipole: 0.0016 2.4589 0.0134
dipole: 2.4590
quadrupole: -152.8719 -121.2291 -124.2223
quadrupole: 0.0450 -30.0281 -0.0116
quadrupole: -20.0974 11.5453 8.5522 0.0450 -30.0281 -0.0116
hfenergy: -1558.724384 hartree
pointgroup: C01 [X(C10H22N4O2S2)]
dipole: -0.0007383 -0.9674245 0.0030271 debye
polarizability: 274.8727716|-0.0393497|160.384231|11.417542|0.0321679|131.2143102 unknown
InChI: InChI=1S/C10H22N4O2S2/c11-3-1-9(15)13-5-7-17-18-8-6-14-10(16)2-4-12/h13-14H,1-8,11-12H2
charge 0 multiplicity 1
40 atoms
S  0.718851 0.355084 0.886402
S  -0.719147 0.357501 -0.882013
O  5.644767 1.195398 -0.735806
O  -5.644626 1.195637 0.734535
N  3.604727 0.083865 -0.599103
N  -3.605477 0.0819 0.602869
N  7.664151 -2.35591 0.659294
N  -7.664317 -2.352142 -0.669107
C  2.794774 1.273188 -0.878845
C  -2.795113 1.270118 0.88605
C  5.674272 -1.224713 -0.2885
C  -5.675516 -1.224012 0.284577
C  1.94128 1.703995 0.323002
C  -1.941718 1.704549 -0.314619
C  4.99276 0.120865 -0.550159
C  -4.993323 0.120537 0.549721
C  6.939334 -1.073142 0.584366
C  -6.938598 -1.070098 -0.590722
H  3.503952 2.081688 -1.13551
H  2.136123 1.096013 -1.751091
H  -3.503945 2.078099 1.145244
H  -2.136351 1.089935 1.757568
H  5.993103 -1.655882 -1.257014
H  4.966917 -1.945152 0.169643
H  -4.967818 -1.944394 -0.17313
H  -5.996722 -1.656366 1.251781
H  2.565218 1.880828 1.217717
H  1.357811 2.612386 0.099535
H  -2.565787 1.883916 -1.208737
H  -1.358409 2.612407 -0.088564
H  3.114212 -0.79063 -0.399945
H  -3.115399 -0.792802 0.403637
H  6.648691 -0.653428 1.576885
H  7.58991 -0.323102 0.10296
H  -6.645523 -0.649152 -1.581999
H  -7.589582 -0.320221 -0.109612
H  7.183296 -3.086003 1.193746
H  8.648846 -2.272155 0.925248
H  -7.183135 -3.081743 -1.203926
H  -8.648491 -2.26716 -0.936575
