program: Orca
programVersion: 5.0.2
elementType: O O O C C C C C C C C C C C C C C C C C C C C C C H H H H H H H H H H H H H H H H H H H H H H H H H H
charge: 0
multiplicity: 1
keywords: wb97x-d3
keywords: def2-TZVPP
keywords: def2/J RIJCOSX
keywords: DEFGRID2
keywords: scfconv7
keywords: smallprint printgap noloewdin
keywords: NOSOSCF
formula: C22H26O3
InChI: InChI=1/C22H26O3/c1-15(2)10-19-20(22(19,3)4)21(23)25-14-17-12-18(24-13-17)11-16-8-6-5-7-9-16/h5-10,12-13,19-20H,11,14H2,1-4H3
51 atoms
O  1.792359 -2.128146 -0.962697
O  2.404173 -1.833067 1.167115
O  -1.966129 -2.091828 1.260913
C  4.139555 0.542366 0.071941
C  2.791815 1.052386 0.439234
C  2.910118 -0.163745 -0.472686
C  4.941291 1.289508 -0.96739
C  4.997327 -0.093171 1.137768
C  2.201324 2.307043 -0.086559
C  2.378264 -1.443164 0.022557
C  0.904559 2.425764 -0.383637
C  0.321612 3.708107 -0.888507
C  -0.047444 1.26957 -0.250951
C  0.968638 -3.247763 -0.596451
C  -0.348445 -2.772021 -0.094635
C  -1.448662 -2.294296 -0.879023
C  -0.726662 -2.617572 1.196304
C  -2.403448 -1.895862 -0.006005
C  -3.746295 -1.281114 -0.184633
C  -3.722689 0.220785 -0.015696
C  -3.613065 0.796282 1.248666
C  -3.783954 1.056281 -1.127146
C  -3.560602 2.175004 1.396269
C  -3.736876 2.436773 -0.982179
C  -3.621956 3.000771 0.280814
H  2.478957 0.791545 1.448816
H  2.710534 0.022076 -1.521821
H  4.315497 1.716205 -1.751973
H  5.661839 0.623993 -1.446849
H  5.503027 2.1063 -0.509218
H  5.643717 -0.866308 0.718022
H  4.418074 -0.539368 1.942878
H  5.643935 0.66576 1.583358
H  2.857824 3.164842 -0.203826
H  -0.171371 3.560993 -1.853269
H  -0.447359 4.082522 -0.207066
H  1.074989 4.487036 -1.007891
H  -1.083763 1.602308 -0.294746
H  0.08873 0.550362 -1.062672
H  0.083555 0.721078 0.683374
H  1.473074 -3.884336 0.131116
H  0.85271 -3.818561 -1.51662
H  -1.512813 -2.258054 -1.955724
H  -0.241277 -2.838108 2.134188
H  -4.452573 -1.726744 0.521421
H  -4.101948 -1.532257 -1.184637
H  -3.573376 0.164148 2.128046
H  -3.870693 0.623743 -2.117247
H  -3.474178 2.606175 2.385705
H  -3.788587 3.071398 -1.857975
H  -3.583803 4.076556 0.39646
elementType: O C H
totalener: -1079.75094844 hartree
nucrepener: 2218.05139033 hartree
electener: -3297.80233877 hartree
oneelecener: -5875.56966072 hartree
twoeener: 2577.76732195 hartree
cpcmener: -0.02294704 hartree
kineticenergy: 1074.86242592 hartree
xcener: -106.463144760590 hartree
chargesum: -0.0000000
charge: -0.289591 -0.474633 -0.277386 0.164819 0.001987 -0.093704 -0.286397 -0.282158 -0.336377 0.359171 0.047809 -0.243590 -0.223794 0.090196 -0.057304 -0.375392 -0.019103 0.239943 -0.066283 0.040068 -0.206407 -0.178798 -0.132846 -0.134656 -0.190730 0.101032 0.092455 0.091396 0.097734 0.098400 0.097535 0.092300 0.092615 0.119829 0.101393 0.095566 0.093781 0.021074 0.105976 0.102465 0.116240 0.118510 0.156812 0.169097 0.117028 0.103378 0.137168 0.137024 0.156119 0.153507 0.156728
qa: -0.2896 -0.4746 -0.2774 0.1648 0.0020 -0.0937 -0.2864 -0.2822 -0.3364 0.3592 0.0478 -0.2436 -0.2238 0.0902 -0.0573 -0.3754 -0.0191 0.2399 -0.0663 0.0401 -0.2064 -0.1788 -0.1328 -0.1347 -0.1907 0.1010 0.0925 0.0914 0.0977 0.0984 0.0975 0.0923 0.0926 0.1198 0.1014 0.0956 0.0938 0.0211 0.1060 0.1025 0.1162 0.1185 0.1568 0.1691 0.1170 0.1034 0.1372 0.1370 0.1561 0.1535 0.1567
va: 2.1013 2.0252 2.2724 3.7124 3.7982 3.8012 3.9086 3.8846 3.9132 4.1909 3.6827 3.9150 3.9563 3.8264 3.6157 3.9671 3.9423 3.5521 3.8120 3.5989 3.9412 3.8907 3.8638 3.8351 3.8660 1.0261 1.0333 1.0022 1.0029 1.0001 0.9996 1.0208 1.0009 1.0047 0.9945 0.9955 1.0099 1.0365 1.0021 1.0015 1.0128 0.9929 1.0103 1.0045 1.0068 1.0126 1.0145 1.0041 0.9907 0.9930 0.9923
dispcorr: -0.028660391 hartree
energy: -1079.779608833857
dipole: 11.92523 -12.46554 -0.54031 16.15186 -15.78405 0.36781 -4.50416 3.36362 -1.14054
magnitude: 1.31455 au
magnitude: 3.34132 debye
