program: Orca
programVersion: 5.0.2
elementType: O O O C C C C C C C C C C C C C C C C C C C C C C H H H H H H H H H H H H H H H H H H H H H H H H H H
charge: 0
multiplicity: 1
keywords: wb97x-d3
keywords: def2-TZVPP
keywords: def2/J RIJCOSX
keywords: DEFGRID2
keywords: scfconv7
keywords: smallprint printgap noloewdin
keywords: NOSOSCF
formula: C22H26O3
InChI: InChI=1/C22H26O3/c1-15(2)10-19-20(22(19,3)4)21(23)25-14-17-12-18(24-13-17)11-16-8-6-5-7-9-16/h5-10,12-13,19-20H,11,14H2,1-4H3
51 atoms
O  1.921379 -2.245266 -0.818029
O  1.929013 -1.701802 1.350225
O  -2.298862 -1.989224 -1.004556
C  3.608947 0.78773 0.497662
C  2.166122 1.136139 0.364249
C  2.698286 -0.134303 -0.288898
C  4.615198 1.538945 -0.341893
C  4.151626 0.387626 1.847884
C  1.68059 2.259196 -0.478479
C  2.170117 -1.418746 0.199521
C  0.624417 2.208016 -1.295102
C  0.207742 3.397974 -2.104215
C  -0.212555 0.979493 -1.489178
C  1.05382 -3.368912 -0.575319
C  -0.348652 -2.887491 -0.442633
C  -1.042455 -2.490442 0.746664
C  -1.169463 -2.558412 -1.468713
C  -2.215499 -1.946768 0.347145
C  -3.296626 -1.237759 1.07889
C  -3.157529 0.258889 0.915542
C  -3.986653 0.968375 0.054546
C  -2.148081 0.942345 1.590884
C  -3.815374 2.335998 -0.126378
C  -1.973225 2.30592 1.411999
C  -2.808166 3.008404 0.550552
H  1.577444 0.944101 1.259548
H  2.815524 -0.084239 -1.365362
H  5.518634 0.941891 -0.481568
H  4.909039 2.470003 0.147406
H  4.231805 1.790556 -1.331094
H  3.39706 -0.035551 2.506085
H  4.56468 1.266253 2.347909
H  4.959358 -0.340466 1.748943
H  2.227287 3.195347 -0.396941
H  0.199516 3.161748 -3.171898
H  -0.810215 3.706269 -1.850192
H  0.866892 4.253171 -1.954393
H  -1.274146 1.235837 -1.50503
H  0.004639 0.510861 -2.453731
H  -0.062734 0.231576 -0.713837
H  1.37943 -3.936575 0.296764
H  1.173787 -4.001895 -1.452909
H  -0.70352 -2.587786 1.765558
H  -1.079543 -2.664062 -2.539271
H  -3.225056 -1.509521 2.133404
H  -4.278825 -1.566357 0.730815
H  -4.774615 0.450385 -0.479769
H  -1.487598 0.400106 2.25858
H  -4.470344 2.874818 -0.799541
H  -1.182604 2.821733 1.942246
H  -2.673714 4.073396 0.409945
elementType: O C H
totalener: -1079.75018657 hartree
nucrepener: 2273.30441357 hartree
electener: -3353.05460014 hartree
oneelecener: -5986.18830584 hartree
twoeener: 2633.13370570 hartree
cpcmener: -0.02309027 hartree
kineticenergy: 1074.86590292 hartree
xcener: -106.464252520051 hartree
chargesum: -0.0000000
charge: -0.287387 -0.471880 -0.270429 0.162414 -0.005409 -0.091394 -0.287530 -0.287914 -0.301980 0.365039 -0.011606 -0.223549 -0.211571 0.076442 -0.069434 -0.286836 -0.053350 0.181748 -0.053010 0.059297 -0.189768 -0.210323 -0.128942 -0.138019 -0.206034 0.100257 0.091409 0.097667 0.098274 0.092409 0.092833 0.092202 0.098628 0.119446 0.098718 0.091365 0.089691 0.097956 0.121918 0.025476 0.116114 0.121199 0.156218 0.172375 0.115334 0.107158 0.137592 0.138574 0.155205 0.154536 0.158873
qa: -0.2874 -0.4719 -0.2704 0.1624 -0.0054 -0.0914 -0.2875 -0.2879 -0.3020 0.3650 -0.0116 -0.2235 -0.2116 0.0764 -0.0694 -0.2868 -0.0533 0.1817 -0.0530 0.0593 -0.1898 -0.2103 -0.1289 -0.1380 -0.2060 0.1003 0.0914 0.0977 0.0983 0.0924 0.0928 0.0922 0.0986 0.1194 0.0987 0.0914 0.0897 0.0980 0.1219 0.0255 0.1161 0.1212 0.1562 0.1724 0.1153 0.1072 0.1376 0.1386 0.1552 0.1545 0.1589
va: 2.1068 2.0266 2.2622 3.7094 3.7936 3.8076 3.9062 3.8826 3.8630 4.1867 3.7213 3.9274 3.9201 3.8533 3.6353 3.9711 3.9248 3.6448 3.8201 3.5578 3.9511 3.8767 3.8578 3.8189 3.8649 1.0239 1.0323 1.0030 1.0004 1.0023 1.0214 1.0008 0.9992 1.0053 0.9963 0.9970 1.0069 1.0010 1.0037 1.0137 1.0081 0.9958 1.0172 0.9949 1.0084 1.0119 1.0055 1.0068 0.9908 0.9932 0.9906
dispcorr: -0.030805014 hartree
energy: -1079.780991583682
dipole: 11.21710 -11.38426 -0.16715 16.38912 -16.08715 0.30197 -2.87546 2.06057 -0.81489
magnitude: 0.88497 au
magnitude: 2.24942 debye
