program: Orca
programVersion: 5.0.2
elementType: O O O C C C C C C C C C C C C C C C C C C C C C C H H H H H H H H H H H H H H H H H H H H H H H H H H
charge: 0
multiplicity: 1
keywords: wb97x-d3
keywords: def2-TZVPP
keywords: def2/J RIJCOSX
keywords: DEFGRID2
keywords: scfconv7
keywords: smallprint printgap noloewdin
keywords: NOSOSCF
formula: C22H26O3
InChI: InChI=1/C22H26O3/c1-15(2)10-19-20(22(19,3)4)21(23)25-14-17-12-18(24-13-17)11-16-8-6-5-7-9-16/h5-10,12-13,19-20H,11,14H2,1-4H3
51 atoms
O  0.959182 -0.069792 -0.141932
O  2.177318 1.51158 0.859189
O  -2.580057 -2.078786 -0.761781
C  4.562219 -0.170837 -0.303616
C  4.326131 1.039762 -1.156525
C  3.167134 0.126532 -0.824447
C  5.257451 -1.366273 -0.909188
C  4.899333 0.027926 1.153912
C  4.796625 1.129153 -2.554943
C  2.087059 0.618587 0.058155
C  5.625543 2.046621 -3.057588
C  6.008766 2.027421 -4.507426
C  6.244635 3.156621 -2.263542
C  -0.16679 0.296576 0.645156
C  -1.308876 -0.567053 0.247103
C  -2.621557 -0.530566 0.815637
C  -1.348208 -1.526671 -0.703602
C  -3.3465 -1.469245 0.162471
C  -4.761515 -1.918762 0.282378
C  -5.486584 -1.15507 1.355964
C  -5.48999 -1.611845 2.668914
C  -6.130247 0.042253 1.063131
C  -6.125422 -0.891323 3.669007
C  -6.767333 0.766102 2.059745
C  -6.766557 0.300659 3.366316
H  4.311231 1.973002 -0.603369
H  2.828267 -0.52871 -1.619844
H  5.032323 -2.269503 -0.33969
H  6.339308 -1.222741 -0.893379
H  4.968924 -1.547241 -1.943489
H  4.440214 0.916317 1.579474
H  5.980769 0.122493 1.268089
H  4.581339 -0.831445 1.747679
H  4.419794 0.37007 -3.234713
H  7.090186 1.924571 -4.628044
H  5.53221 1.210131 -5.047632
H  5.728548 2.962118 -4.999951
H  5.977121 3.139661 -1.209132
H  7.334875 3.107651 -2.325537
H  5.954994 4.130452 -2.666977
H  -0.409917 1.352473 0.492741
H  0.057983 0.174861 1.709135
H  -2.977022 0.110539 1.606149
H  -0.612473 -1.911718 -1.388766
H  -4.790811 -2.990921 0.500608
H  -5.271727 -1.793819 -0.677919
H  -4.9881 -2.540945 2.91191
H  -6.130648 0.413016 0.044983
H  -6.120656 -1.262198 4.685545
H  -7.266733 1.69433 1.814639
H  -7.265531 0.863057 4.144387
totalener: -1079.73334069 hartree
nucrepener: 1987.15952552 hartree
electener: -3066.89286621 hartree
oneelecener: -5412.38671353 hartree
twoeener: 2345.49384732 hartree
kineticenergy: 1074.89452049 hartree
xcener: -106.466124085074 hartree
chargesum: -0.0000000
charge: -0.267495 -0.387019 -0.256411 0.102508 0.036164 -0.104958 -0.232901 -0.263771 -0.190866 0.323750 -0.040893 -0.206443 -0.237756 0.084999 -0.003710 -0.269328 -0.054572 0.166186 -0.055140 0.018508 -0.155046 -0.155616 -0.122904 -0.123882 -0.126853 0.090717 0.069164 0.090917 0.090453 0.070653 0.102105 0.084226 0.084510 0.074564 0.083475 0.076525 0.085175 0.083449 0.083680 0.088217 0.098651 0.097754 0.140372 0.143967 0.092257 0.093115 0.110859 0.111454 0.125383 0.125679 0.126125
qa: -0.2675 -0.3870 -0.2564 0.1025 0.0362 -0.1050 -0.2329 -0.2638 -0.1909 0.3237 -0.0409 -0.2064 -0.2378 0.0850 -0.0037 -0.2693 -0.0546 0.1662 -0.0551 0.0185 -0.1550 -0.1556 -0.1229 -0.1239 -0.1269 0.0907 0.0692 0.0909 0.0905 0.0707 0.1021 0.0842 0.0845 0.0746 0.0835 0.0765 0.0852 0.0834 0.0837 0.0882 0.0987 0.0978 0.1404 0.1440 0.0923 0.0931 0.1109 0.1115 0.1254 0.1257 0.1261
va: 2.1415 2.1185 2.2962 3.7317 3.7713 3.9296 3.9094 3.9110 3.8976 4.2313 3.7999 3.9370 3.9478 3.8609 3.7195 4.0066 3.9893 3.7268 3.8666 3.6697 3.9818 3.9809 3.9600 3.9593 3.9535 1.0349 1.0366 1.0049 1.0055 1.0107 1.0221 1.0014 1.0027 1.0194 0.9986 1.0121 0.9981 1.0136 0.9997 0.9989 0.9933 0.9933 1.0068 1.0112 1.0073 1.0067 1.0110 1.0110 1.0004 1.0003 0.9996
dispcorr: -0.021158271 hartree
energy: -1079.754498965876
dipole: 32.33377 -32.31110 0.02266 6.95221 -7.21329 -0.26108 -8.89984 8.66153 -0.23831
magnitude: 0.35422 au
magnitude: 0.90035 debye
