program: Orca
programVersion: 5.0.2
elementType: O O O C C C C C C C C C C C C C C C C C C C C C C H H H H H H H H H H H H H H H H H H H H H H H H H H
charge: 0
multiplicity: 1
keywords: wb97x-d3
keywords: def2-TZVPP
keywords: def2/J RIJCOSX
keywords: DEFGRID2
keywords: scfconv7
keywords: smallprint printgap noloewdin
keywords: NOSOSCF
formula: C22H26O3
InChI: InChI=1/C22H26O3/c1-15(2)10-19-20(22(19,3)4)21(23)25-14-17-12-18(24-13-17)11-16-8-6-5-7-9-16/h5-10,12-13,19-20H,11,14H2,1-4H3
51 atoms
O  1.801725 -2.199057 -0.073482
O  0.979404 -1.350524 -1.97476
O  -2.103622 -2.758598 1.777155
C  1.841081 1.312706 -0.535975
C  2.776152 1.001596 -1.664697
C  2.487863 -0.061107 -0.639977
C  2.323983 2.173031 0.606125
C  0.372743 1.494196 -0.834338
C  4.143938 1.576031 -1.758399
C  1.677086 -1.245108 -0.998625
C  4.422052 2.837032 -2.09136
C  5.834699 3.327655 -2.189663
C  3.368772 3.856549 -2.401934
C  0.935757 -3.33549 -0.171881
C  -0.42069 -3.024855 0.354918
C  -1.518228 -2.409929 -0.327965
C  -0.847115 -3.208707 1.62697
C  -2.508047 -2.27119 0.584182
C  -3.850714 -1.637806 0.524121
C  -3.867216 -0.283456 1.194823
C  -3.212836 0.792316 0.602212
C  -4.503109 -0.089713 2.413298
C  -3.196883 2.035327 1.212409
C  -4.489451 1.15493 3.028934
C  -3.837687 2.220722 2.430068
H  2.281393 0.828575 -2.617812
H  3.258708 -0.251492 0.099518
H  2.193577 3.231424 0.37143
H  3.378234 2.016862 0.830009
H  1.750319 1.960638 1.509904
H  0.04425 0.924974 -1.700593
H  0.169131 2.549252 -1.032747
H  -0.239456 1.196189 0.01945
H  4.971402 0.900155 -1.560954
H  6.556767 2.548306 -1.949523
H  6.055599 3.690636 -3.196547
H  6.007122 4.167447 -1.512056
H  3.489204 4.238378 -3.418884
H  2.358667 3.462059 -2.312111
H  3.45568 4.719104 -1.736595
H  1.416516 -4.102883 0.433884
H  0.888798 -3.695048 -1.200736
H  -1.546764 -2.106185 -1.361051
H  -0.376575 -3.636687 2.497753
H  -4.599996 -2.290198 0.979967
H  -4.127065 -1.535778 -0.527271
H  -2.703648 0.651865 -0.344358
H  -5.011729 -0.919162 2.889655
H  -2.683383 2.860977 0.736877
H  -4.988232 1.289515 3.979795
H  -3.82748 3.191026 2.908876
totalener: -1079.73157604 hartree
nucrepener: 2138.03372819 hartree
electener: -3217.76530424 hartree
oneelecener: -5714.42444348 hartree
twoeener: 2496.65913924 hartree
kineticenergy: 1074.91569148 hartree
xcener: -106.467362389315 hartree
chargesum: -0.0000000
charge: -0.259283 -0.400535 -0.249057 0.089208 -0.022383 -0.093063 -0.251302 -0.302369 -0.195224 0.366529 -0.019200 -0.210471 -0.247376 0.045803 -0.053996 -0.291032 -0.032279 0.240777 -0.137298 0.086460 -0.190209 -0.147530 -0.127545 -0.121811 -0.131886 0.108259 0.080098 0.081816 0.084008 0.101133 0.103876 0.083133 0.097977 0.088607 0.079037 0.086278 0.083959 0.098467 0.084375 0.088261 0.098567 0.113646 0.147482 0.133967 0.095973 0.112582 0.127458 0.104847 0.124329 0.123043 0.123893
qa: -0.2593 -0.4005 -0.2491 0.0892 -0.0224 -0.0931 -0.2513 -0.3024 -0.1952 0.3665 -0.0192 -0.2105 -0.2474 0.0458 -0.0540 -0.2910 -0.0323 0.2408 -0.1373 0.0865 -0.1902 -0.1475 -0.1275 -0.1218 -0.1319 0.1083 0.0801 0.0818 0.0840 0.1011 0.1039 0.0831 0.0980 0.0886 0.0790 0.0863 0.0840 0.0985 0.0844 0.0883 0.0986 0.1136 0.1475 0.1340 0.0960 0.1126 0.1275 0.1048 0.1243 0.1230 0.1239
va: 2.1319 2.1043 2.3133 3.7295 3.8161 3.8493 3.9014 3.9077 3.8689 4.2310 3.7351 3.9379 3.9345 3.9057 3.7055 4.0005 4.0011 3.5836 3.8817 3.6293 3.9850 4.0056 3.9611 3.9581 3.9688 1.0256 1.0348 1.0017 1.0076 1.0056 1.0207 1.0038 0.9992 1.0135 1.0105 0.9982 0.9989 1.0041 1.0099 0.9983 0.9967 1.0060 1.0222 1.0074 1.0143 1.0057 0.9990 1.0121 1.0011 1.0005 0.9998
dispcorr: -0.025324519 hartree
energy: -1079.756900561534
dipole: 16.74582 -16.53283 0.21299 24.20921 -23.86722 0.34199 -6.76928 7.18330 0.41402
magnitude: 0.57770 au
magnitude: 1.46839 debye
