program: Orca
programVersion: 5.0.2
elementType: O O O C C C C C C C C C C C C C C C C C C C C C C H H H H H H H H H H H H H H H H H H H H H H H H H H
charge: 0
multiplicity: 1
keywords: wb97x-d3
keywords: def2-TZVPP
keywords: def2/J RIJCOSX
keywords: DEFGRID2
keywords: scfconv7
keywords: smallprint printgap noloewdin
keywords: NOSOSCF
formula: C22H26O3
InChI: InChI=1/C22H26O3/c1-15(2)10-19-20(22(19,3)4)21(23)25-14-17-12-18(24-13-17)11-16-8-6-5-7-9-16/h5-10,12-13,19-20H,11,14H2,1-4H3
51 atoms
O  1.075797 -1.762751 -1.619807
O  0.352727 0.33135 -1.311644
O  -1.591236 -3.104435 1.545709
C  3.192995 0.58257 0.03821
C  3.169778 1.261964 -1.297326
C  2.691087 -0.160144 -1.190259
C  4.515307 0.107463 0.588461
C  2.230465 1.037908 1.107176
C  4.404515 1.566226 -2.066491
C  1.254235 -0.463221 -1.371613
C  5.222834 2.587962 -1.814386
C  6.43598 2.847282 -2.654437
C  5.002456 3.555178 -0.69184
C  -0.270857 -2.225792 -1.750774
C  -0.967546 -2.333759 -0.438428
C  -1.919513 -1.432005 0.133447
C  -0.815306 -3.325344 0.471155
C  -2.268417 -1.95297 1.332816
C  -3.196037 -1.508876 2.410369
C  -4.16397 -0.464938 1.923674
C  -5.244358 -0.830189 1.125436
C  -3.996243 0.875365 2.246112
C  -6.139619 0.121358 0.666122
C  -4.891177 1.832866 1.787997
C  -5.965332 1.458362 0.997248
H  2.361894 1.980061 -1.416039
H  3.36142 -0.930872 -1.556628
H  4.364895 -0.715381 1.289492
H  5.018741 0.914019 1.125459
H  5.193472 -0.233743 -0.192378
H  1.294689 1.414927 0.702555
H  2.687665 1.837018 1.694527
H  1.994458 0.222111 1.793077
H  4.63386 0.915259 -2.905336
H  6.544202 2.117535 -3.455856
H  6.394268 3.840109 -3.109252
H  7.345525 2.820772 -2.049067
H  5.869863 3.582155 -0.027561
H  4.875311 4.570797 -1.075293
H  4.127776 3.313795 -0.091144
H  -0.173244 -3.205462 -2.21744
H  -0.832534 -1.583914 -2.431384
H  -2.285223 -0.51689 -0.301532
H  -0.211925 -4.219145 0.48246
H  -2.62571 -1.119483 3.259838
H  -3.74604 -2.374942 2.791037
H  -5.382817 -1.871681 0.860158
H  -3.157514 1.17556 2.862611
H  -6.976069 -0.17994 0.049166
H  -4.74733 2.872601 2.05092
H  -6.665192 2.20269 0.641049
totalener: -1079.73130105 hartree
nucrepener: 2078.22029987 hartree
electener: -3157.95160092 hartree
oneelecener: -5594.99955111 hartree
twoeener: 2437.04795019 hartree
kineticenergy: 1074.91881530 hartree
xcener: -106.467487749854 hartree
chargesum: 0.0000000
charge: -0.262322 -0.394345 -0.252989 0.068437 -0.027884 -0.093388 -0.247730 -0.265132 -0.190207 0.365853 -0.022096 -0.211352 -0.244551 0.044599 -0.080492 -0.200731 -0.036510 0.162780 -0.062565 0.011890 -0.165351 -0.135102 -0.114774 -0.121576 -0.130543 0.107890 0.078629 0.096719 0.083545 0.082571 0.103133 0.079893 0.089717 0.089021 0.079226 0.085709 0.083867 0.086748 0.097748 0.084246 0.105320 0.109697 0.145197 0.136727 0.085765 0.102460 0.112066 0.107600 0.124611 0.123346 0.124631
qa: -0.2623 -0.3943 -0.2530 0.0684 -0.0279 -0.0934 -0.2477 -0.2651 -0.1902 0.3659 -0.0221 -0.2114 -0.2446 0.0446 -0.0805 -0.2007 -0.0365 0.1628 -0.0626 0.0119 -0.1654 -0.1351 -0.1148 -0.1216 -0.1305 0.1079 0.0786 0.0967 0.0835 0.0826 0.1031 0.0799 0.0897 0.0890 0.0792 0.0857 0.0839 0.0867 0.0977 0.0842 0.1053 0.1097 0.1452 0.1367 0.0858 0.1025 0.1121 0.1076 0.1246 0.1233 0.1246
va: 2.1345 2.1127 2.3011 3.7452 3.8129 3.8432 3.9041 3.9086 3.8579 4.2304 3.7379 3.9388 3.9355 3.9055 3.6803 3.9611 3.9889 3.6739 3.8388 3.6874 3.9910 3.9727 3.9506 3.9644 3.9582 1.0271 1.0344 1.0059 1.0022 1.0073 1.0218 1.0024 1.0026 1.0130 1.0104 0.9982 0.9988 0.9989 1.0035 1.0111 0.9948 1.0051 1.0164 1.0072 1.0075 1.0072 1.0097 1.0117 1.0000 1.0008 1.0000
dispcorr: -0.023340934 hartree
energy: -1079.754641980829
dipole: 27.00141 -26.57363 0.42778 17.01472 -17.11701 -0.10229 -0.82770 0.93260 0.10490
magnitude: 0.45217 au
magnitude: 1.14933 debye
