program: Gaussian 09
title: 000069522
version: EM64L-G09RevD.01
frameworkgroup: C1[X(C8H17NO2)]
method: RPBEPBE
basis: SDD
operation: Freq
keyword: #p
keyword: freq=noraman
keyword: PBEPBE/SDD
title: #p freq=noraman PBEPBE/SDD
converged: YES YES NO NO
title: Mulliken charges:
elementType: O O N C C C C C C C C H H H H H H H H H H H H H H H H H
charge: -0.415809 -0.233281 -0.570686 -0.350813 -0.373295 -0.424667 -0.353534 -0.172301 -0.356011 -0.696001 0.132784 0.236456 0.183563 0.186849 0.190807 0.208763 0.223574 0.187787 0.190947 0.246199 0.194361 0.194803 0.209553 0.210216 0.214865 0.278315 0.279665 0.376888
chargesum: 0.00000
title: Mulliken charges with hydrogens summed into heavy atoms:
elementType: O O N C C C C C C C C
charge: -0.038920 -0.233281 -0.012705 0.069206 0.004361 0.007671 0.025201 0.073897 0.033153 -0.061367 0.132784
polarizability: 1.26746476e+02 2.46659567e+00 9.30616047e+01 -3.17643666e+00 2.27291360e+00 8.55369640e+01
1716.lowfreq: -18.9938 -7.6343 0.0002 0.0003 0.0004 6.1715 26.7070 34.7589 43.8695
frequency: 23.6360 34.1546 43.5498 62.6346 94.5407 109.3831 141.2667 147.6398 206.2033 211.9634 223.1783 266.6184 290.1990 356.7662 408.6379 437.3754 504.4919 594.2376 606.6735 682.9958 708.8593 722.5627 740.2325 785.5190 848.4533 866.0199 887.4723 935.7235 975.4651 1010.1767 1028.9720 1037.6116 1057.7653 1068.4510 1079.8167 1114.5812 1143.8273 1186.6283 1214.7940 1223.4575 1236.8902 1261.7148 1277.8675 1281.8208 1287.9725 1298.0196 1302.9513 1329.8192 1351.6062 1353.1397 1361.9861 1387.5562 1458.8204 1464.1132 1465.8831 1474.6450 1475.3786 1483.2312 1488.7733 1650.9106 1655.0665 2949.7013 2954.8082 2963.4747 2967.2612 2971.3208 2975.1401 2987.2843 3003.7457 3023.0211 3029.1075 3037.8258 3057.2780 3067.7683 3069.8139 3444.9010 3498.7064 3567.3267
redmass: 2.3155 3.2128 4.7678 3.4261 2.5118 1.8505 2.2037 3.7368 3.4657 1.2509 1.1266 3.4038 2.7985 3.0871 3.5063 2.9614 2.8932 1.5689 2.1183 1.7249 3.8903 1.0659 1.1077 1.2157 4.1977 1.3587 1.8738 2.2494 1.3002 3.5446 2.9172 2.1695 1.2930 2.6662 2.1634 2.3900 2.5705 1.8078 1.3151 1.5148 1.3488 1.3329 1.3672 1.1189 1.1701 1.3902 1.2410 1.3988 1.5319 1.6790 1.3875 1.2173 1.0793 1.0641 1.0767 1.0660 1.0487 1.0800 1.0916 1.2233 4.6417 1.0588 1.0592 1.0636 1.0598 1.0364 1.0617 1.0959 1.0999 1.0935 1.0981 1.0943 1.1021 1.1006 1.0993 1.0453 1.0640 1.0965
irintensity: 0.6058 0.2963 0.4480 0.2568 0.3018 0.0465 0.2360 0.0218 2.4874 40.1738 0.0154 7.4553 10.0409 16.6674 10.1967 5.3424 12.4147 103.4098 43.5129 237.8067 33.9268 12.8043 0.8309 6.8619 15.7279 0.3496 4.8570 1.9346 6.8909 6.9354 181.7187 56.8611 0.4690 0.5908 0.6134 29.8896 6.9445 0.2998 12.3811 2.7978 4.2666 0.7920 10.7644 2.7339 1.6190 7.2233 6.0735 0.5467 1.0909 0.7061 4.2693 11.1087 2.6114 0.1511 0.6708 4.1555 9.8586 1.9319 25.2802 5.5293 272.4603 3.3302 8.5772 1.4746 76.8161 37.9803 75.3054 5.9018 3.2443 6.9980 43.3088 5.1203 75.0785 104.4165 55.1996 1.1523 11.4865 3.3272
temp: 298.150 k
press: 1.00000 atm
elementType: 8 8 7 6 6 6 6 6 6 6 6 1 1 1 1 1 1 1 1 1 1 1 1 1 1 1 1 1
symmnumber: 1
zpe: 639997.3 jmol-1
zpe.correction: 0.243762 hartree
zpe.thermalcorrener: 0.258001 hartree
zpe.thermalcorrenthalpy: 0.258945 hartree
zpe.thermalcorrgfe: 0.200458 hartree
zpe.sumelectzpe: -519.340709 hartree
zpe.sumelectthermal: -519.326470 hartree
zpe.sumelectthermalent: -519.325526 hartree
zpe.sumelectthermalfe: -519.384013 hartree
dipole: -0.0494 -0.6672 -0.7429
dipole: 0.9997
quadrupole: -70.2868 -65.8605 -70.2008
quadrupole: 2.4525 5.7701 -0.7952
quadrupole: -1.5041 2.9222 -1.4181 2.4525 5.7701 -0.7952
hfenergy: -519.5844709 hartree
pointgroup: C01 [X(C8H17N1O2)]
dipole: 0.0168214 0.2336091 -0.3159952 debye
polarizability: 126.6134609|3.3607943|92.6649418|3.1585093|-2.8822383|86.066642 unknown
InChI: InChI=1S/C8H17NO2/c1-2-3-4-5-6-7(9)8(10)11/h7,10H,2-6,9H2,1H3
charge 0 multiplicity 1
28 atoms
O  3.476823 1.506266 -0.744094
O  4.033007 0.091381 1.013805
N  2.052894 -1.813046 0.051095
C  -0.556591 -0.254537 -0.340186
C  -1.806775 0.364427 0.324173
C  0.761195 0.3131 0.226394
C  -3.131751 -0.193596 -0.243191
C  2.013986 -0.404971 -0.361041
C  -4.387168 0.418814 0.419063
C  -5.706001 -0.149847 -0.148041
C  3.271654 0.375959 0.062525
H  -0.555603 -1.352582 -0.20469
H  -0.592698 -0.068352 -1.434234
H  -1.790396 1.467504 0.196701
H  -1.771822 0.177376 1.418149
H  0.776138 0.200745 1.330327
H  0.833052 1.39594 0.007252
H  -3.169684 -0.009725 -1.337486
H  -3.150252 -1.295836 -0.113073
H  1.948002 -0.355195 -1.463549
H  -4.369338 1.519851 0.284542
H  -4.345736 0.239131 1.512986
H  -5.784799 0.041491 -1.235041
H  -5.762498 -1.244469 0.003574
H  -6.587817 0.304869 0.340012
H  2.224159 -1.923475 1.057727
H  2.70017 -2.389354 -0.496914
H  4.273649 2.007932 -0.418687
