program: Orca
programVersion: 5.0.2
elementType: O O O C C C C C C C C C C C C C C C C C C C C C C H H H H H H H H H H H H H H H H H H H H H H H H H H
charge: 0
multiplicity: 1
keywords: wb97x-d3
keywords: def2-TZVPP
keywords: def2/J RIJCOSX
keywords: DEFGRID2
keywords: scfconv7
keywords: smallprint printgap noloewdin
keywords: NOSOSCF
formula: C22H26O3
InChI: InChI=1/C22H26O3/c1-15(2)10-19-20(22(19,3)4)21(23)25-14-17-12-18(24-13-17)11-16-8-6-5-7-9-16/h5-10,12-13,19-20H,11,14H2,1-4H3
51 atoms
O  1.457505 -2.195184 -0.993682
O  2.150312 -1.464456 1.004105
O  -2.111812 -2.100492 1.58287
C  4.077776 0.30167 -0.716213
C  2.887891 1.113722 -0.302047
C  2.676857 -0.223595 -0.972393
C  4.849905 0.730993 -1.940661
C  4.953036 -0.305009 0.352536
C  2.485825 2.355129 -1.004366
C  2.086884 -1.332958 -0.191326
C  2.655302 3.594985 -0.542383
C  2.183044 4.786045 -1.32047
C  3.313955 3.910859 0.76609
C  0.756419 -3.273031 -0.36377
C  -0.555156 -2.835521 0.185383
C  -1.788171 -2.678707 -0.524313
C  -0.823711 -2.462328 1.458809
C  -2.696268 -2.230497 0.373608
C  -4.124139 -1.833345 0.258989
C  -4.315504 -0.340713 0.38872
C  -4.083156 0.491515 -0.701205
C  -4.692154 0.229416 1.59808
C  -4.229406 1.864433 -0.587891
C  -4.838226 1.60426 1.716527
C  -4.607402 2.425305 0.623897
H  2.688698 1.094569 0.765164
H  2.363065 -0.196021 -2.010509
H  5.395838 -0.112605 -2.366671
H  5.576675 1.502244 -1.679243
H  4.209215 1.141401 -2.720291
H  5.446969 -1.207309 -0.014021
H  4.403364 -0.567067 1.252627
H  5.734262 0.40554 0.630024
H  2.002716 2.233894 -1.969681
H  3.011683 5.460362 -1.551181
H  1.710384 4.501552 -2.259782
H  1.458855 5.368478 -0.745158
H  3.687182 3.028673 1.281861
H  4.159932 4.586158 0.615859
H  2.622104 4.426075 1.437213
H  1.373532 -3.727187 0.412609
H  0.615034 -4.008332 -1.155246
H  -1.968509 -2.875154 -1.569314
H  -0.208115 -2.397121 2.340484
H  -4.721146 -2.352476 1.014061
H  -4.490088 -2.174267 -0.711288
H  -3.780229 0.059637 -1.647917
H  -4.872015 -0.406147 2.456717
H  -4.048202 2.497961 -1.446328
H  -5.132584 2.034089 2.665076
H  -4.722342 3.497389 0.71455
totalener: -1079.73235718 hartree
nucrepener: 2091.04669216 hartree
electener: -3170.77904933 hartree
oneelecener: -5620.64776811 hartree
twoeener: 2449.86871878 hartree
kineticenergy: 1074.91154781 hartree
xcener: -106.465454902115 hartree
chargesum: -0.0000000
charge: -0.265912 -0.409211 -0.250862 0.137683 -0.014643 -0.138897 -0.232766 -0.275676 -0.187388 0.378947 -0.027276 -0.212211 -0.237677 0.063172 -0.082427 -0.282824 0.013079 0.222544 -0.140603 0.093952 -0.164610 -0.154027 -0.122458 -0.121418 -0.133803 0.099117 0.071230 0.090901 0.086280 0.074922 0.085236 0.103788 0.081790 0.082384 0.083122 0.077354 0.085840 0.081846 0.083207 0.090405 0.110552 0.101755 0.123482 0.147530 0.101262 0.103339 0.105076 0.106305 0.122315 0.122840 0.123436
qa: -0.2659 -0.4092 -0.2509 0.1377 -0.0146 -0.1389 -0.2328 -0.2757 -0.1874 0.3789 -0.0273 -0.2122 -0.2377 0.0632 -0.0824 -0.2828 0.0131 0.2225 -0.1406 0.0940 -0.1646 -0.1540 -0.1225 -0.1214 -0.1338 0.0991 0.0712 0.0909 0.0863 0.0749 0.0852 0.1038 0.0818 0.0824 0.0831 0.0774 0.0858 0.0818 0.0832 0.0904 0.1106 0.1018 0.1235 0.1475 0.1013 0.1033 0.1051 0.1063 0.1223 0.1228 0.1234
va: 2.1356 2.0896 2.3191 3.6896 3.7894 3.9625 3.9065 3.9060 3.8897 4.1958 3.7523 3.9402 3.9482 3.8692 3.6889 4.0560 3.9721 3.6268 3.8882 3.6084 4.0067 4.0158 3.9680 3.9584 3.9626 1.0279 1.0404 1.0048 1.0064 1.0089 1.0027 1.0227 1.0017 1.0165 0.9986 1.0115 0.9975 1.0116 0.9998 0.9998 1.0106 0.9943 1.0173 1.0140 1.0095 1.0091 1.0120 1.0137 1.0006 1.0005 1.0001
dispcorr: -0.022173329 hartree
energy: -1079.754530505729
dipole: 21.09784 -21.13277 -0.03493 20.33655 -20.11464 0.22191 -5.98206 5.38202 -0.60004
magnitude: 0.64071 au
magnitude: 1.62856 debye
