program: Orca
programVersion: 5.0.2
elementType: O O O C C C C C C C C C C C C C C C C C C C C C C H H H H H H H H H H H H H H H H H H H H H H H H H H
charge: 0
multiplicity: 1
keywords: wb97x-d3
keywords: def2-TZVPP
keywords: def2/J RIJCOSX
keywords: DEFGRID2
keywords: scfconv7
keywords: smallprint printgap noloewdin
keywords: NOSOSCF
formula: C22H26O3
InChI: InChI=1/C22H26O3/c1-15(2)10-19-20(22(19,3)4)21(23)25-14-17-12-18(24-13-17)11-16-8-6-5-7-9-16/h5-10,12-13,19-20H,11,14H2,1-4H3
51 atoms
O  1.732388 -2.052479 -0.051357
O  1.160599 -1.273364 -2.071164
O  -2.591662 -2.359966 -0.353993
C  1.058731 1.354488 -0.303499
C  2.151438 1.424319 -1.320793
C  2.060719 0.213096 -0.429306
C  1.170801 2.18107 0.954724
C  -0.367972 1.176878 -0.765413
C  3.28623 2.374556 -1.185958
C  1.612888 -1.08522 -0.972219
C  4.55494 2.117341 -1.506747
C  5.625565 3.154388 -1.347732
C  5.018864 0.800208 -2.049148
C  0.959563 -3.235453 -0.272272
C  -0.474435 -2.929183 -0.024869
C  -1.057042 -2.548401 1.225327
C  -1.45868 -2.785943 -0.941233
C  -2.339062 -2.20647 0.963886
C  -3.409505 -1.601903 1.801168
C  -3.415016 -0.096945 1.662067
C  -4.098021 0.518802 0.619254
C  -2.681623 0.693996 2.539613
C  -4.051473 1.895474 0.459201
C  -2.633932 2.070955 2.383705
C  -3.318111 2.67619 1.339981
H  1.822678 1.239049 -2.341077
H  2.775067 0.144361 0.383786
H  0.583745 1.729629 1.756214
H  0.77891 3.187259 0.789912
H  2.199202 2.277439 1.303487
H  -0.966853 0.665793 -0.008603
H  -0.445064 0.615799 -1.693791
H  -0.824203 2.154879 -0.930368
H  3.04272 3.368498 -0.820382
H  5.235278 4.088203 -0.944787
H  6.41511 2.802882 -0.678523
H  6.105513 3.375405 -2.304321
H  4.20933 0.087324 -2.18754
H  5.510513 0.93665 -3.015523
H  5.761069 0.346392 -1.387174
H  1.344287 -3.959559 0.445311
H  1.11755 -3.632922 -1.275966
H  -0.56832 -2.511382 2.185773
H  -1.483863 -2.927625 -2.008994
H  -3.234309 -1.88078 2.841373
H  -4.383958 -2.013393 1.527013
H  -4.668207 -0.083457 -0.077426
H  -2.139613 0.228226 3.354545
H  -4.588866 2.359532 -0.357449
H  -2.061441 2.671778 3.078453
H  -3.282949 3.750476 1.216086
totalener: -1079.72936319 hartree
nucrepener: 2209.67628846 hartree
electener: -3289.40565165 hartree
oneelecener: -5857.89461475 hartree
twoeener: 2568.48896310 hartree
kineticenergy: 1074.91705103 hartree
xcener: -106.468239537990 hartree
chargesum: 0.0000000
charge: -0.265780 -0.380143 -0.250823 0.187144 -0.012562 -0.123998 -0.291886 -0.244146 -0.248353 0.323781 -0.006286 -0.212330 -0.223341 0.066527 -0.062482 -0.280153 0.002452 0.216804 -0.137744 0.074481 -0.141422 -0.148888 -0.123870 -0.147458 -0.129349 0.106112 0.084334 0.084806 0.088696 0.090424 0.052710 0.100570 0.086859 0.091456 0.077492 0.083314 0.086621 0.083791 0.089019 0.084998 0.103322 0.105428 0.121304 0.142236 0.099630 0.108085 0.110536 0.102984 0.123988 0.126468 0.124644
qa: -0.2658 -0.3801 -0.2508 0.1871 -0.0126 -0.1240 -0.2919 -0.2441 -0.2484 0.3238 -0.0063 -0.2123 -0.2233 0.0665 -0.0625 -0.2802 0.0025 0.2168 -0.1377 0.0745 -0.1414 -0.1489 -0.1239 -0.1475 -0.1293 0.1061 0.0843 0.0848 0.0887 0.0904 0.0527 0.1006 0.0869 0.0915 0.0775 0.0833 0.0866 0.0838 0.0890 0.0850 0.1033 0.1054 0.1213 0.1422 0.0996 0.1081 0.1105 0.1030 0.1240 0.1265 0.1246
va: 2.1081 2.1202 2.3002 3.6794 3.8250 3.8345 3.9090 3.9043 3.9032 4.2479 3.7327 3.9417 3.9378 3.8987 3.7099 4.0257 3.9684 3.6096 3.8754 3.6159 3.9836 3.9368 3.9499 3.9355 3.9216 1.0253 1.0314 1.0100 1.0015 1.0077 1.0032 1.0260 1.0056 1.0097 1.0099 0.9992 0.9986 1.0187 1.0019 1.0009 0.9914 1.0109 1.0207 1.0113 1.0123 1.0131 1.0167 1.0126 1.0005 0.9996 1.0003
dispcorr: -0.028174046 hartree
energy: -1079.757537237222
dipole: 17.01819 -16.99146 0.02673 17.60016 -17.44010 0.16005 -0.62503 1.37752 0.75250
magnitude: 0.76979 au
magnitude: 1.95666 debye
