program: Orca
programVersion: 5.0.2
elementType: O O O C C C C C C C C C C C C C C C C C C C C C C H H H H H H H H H H H H H H H H H H H H H H H H H H
charge: 0
multiplicity: 1
keywords: wb97x-d3
keywords: def2-TZVPP
keywords: def2/J RIJCOSX
keywords: DEFGRID2
keywords: scfconv7
keywords: smallprint printgap noloewdin
keywords: NOSOSCF
formula: C22H26O3
InChI: InChI=1/C22H26O3/c1-15(2)10-19-20(22(19,3)4)21(23)25-14-17-12-18(24-13-17)11-16-8-6-5-7-9-16/h5-10,12-13,19-20H,11,14H2,1-4H3
51 atoms
O  1.181453 -0.04244 0.914661
O  2.15331 -1.625217 -0.332552
O  -2.154983 -2.40911 -0.685922
C  2.884714 0.861196 -2.121787
C  4.069664 0.393891 -1.347857
C  2.770048 0.666892 -0.6180
C  2.840748 2.296474 -2.590246
C  2.207665 -0.095237 -3.072863
C  5.259847 1.252417 -1.116395
C  2.023535 -0.465162 -0.030185
C  6.027454 1.218431 -0.026139
C  7.227316 2.104941 0.116003
C  5.764758 0.306932 1.133024
C  0.386028 -1.03852 1.56669
C  -0.815782 -1.412015 0.772371
C  -2.119738 -0.82898 0.859333
C  -0.906678 -2.36424 -0.186445
C  -2.891123 -1.475085 -0.045532
C  -4.322018 -1.345742 -0.438217
C  -5.034512 -0.354588 0.44004
C  -5.738208 -0.775593 1.562249
C  -4.961244 1.007716 0.169493
C  -6.357956 0.143076 2.396418
C  -5.575951 1.929991 1.002447
C  -6.277041 1.49942 2.119451
H  4.280604 -0.667353 -1.456684
H  2.722605 1.58395 -0.041896
H  1.809325 2.617745 -2.743482
H  3.365177 2.407505 -3.541747
H  3.298653 2.982748 -1.877756
H  1.149522 0.148354 -3.185397
H  2.280075 -1.131111 -2.751275
H  2.6704 -0.01961 -4.058758
H  5.532024 1.935706 -1.916013
H  7.364789 2.751381 -0.74998
H  7.142429 2.741214 1.000615
H  8.139073 1.516303 0.243785
H  5.576092 0.881342 2.043688
H  4.916355 -0.354063 0.97145
H  6.638677 -0.316789 1.33638
H  0.086931 -0.57996 2.508526
H  0.993391 -1.915091 1.795901
H  -2.4369 -0.038338 1.519938
H  -0.186129 -3.048816 -0.60175
H  -4.811436 -2.322397 -0.376501
H  -4.394127 -1.038824 -1.486885
H  -5.799849 -1.833539 1.787961
H  -4.411682 1.349487 -0.699655
H  -6.904713 -0.201847 3.264265
H  -5.508522 2.98639 0.77781
H  -6.760019 2.217358 2.769044
totalener: -1079.73275852 hartree
nucrepener: 2061.28609363 hartree
electener: -3141.01885215 hartree
oneelecener: -5560.93532123 hartree
twoeener: 2419.91646908 hartree
kineticenergy: 1074.90871181 hartree
xcener: -106.466834551827 hartree
chargesum: 0.0000000
charge: -0.261340 -0.409813 -0.254785 0.131792 -0.029231 -0.103097 -0.277087 -0.259382 -0.235152 0.352638 -0.003502 -0.210907 -0.227526 0.062823 -0.091276 -0.236370 0.000752 0.158051 -0.049246 0.025428 -0.151946 -0.170104 -0.122596 -0.120276 -0.129352 0.105149 0.083167 0.091518 0.090174 0.084292 0.087404 0.098778 0.083389 0.092695 0.078407 0.084056 0.086437 0.086598 0.081155 0.089121 0.099446 0.113973 0.137963 0.152989 0.089566 0.095000 0.109127 0.114177 0.125150 0.125457 0.126313
qa: -0.2613 -0.4098 -0.2548 0.1318 -0.0292 -0.1031 -0.2771 -0.2594 -0.2352 0.3526 -0.0035 -0.2109 -0.2275 0.0628 -0.0913 -0.2364 0.0008 0.1581 -0.0492 0.0254 -0.1519 -0.1701 -0.1226 -0.1203 -0.1294 0.1051 0.0832 0.0915 0.0902 0.0843 0.0874 0.0988 0.0834 0.0927 0.0784 0.0841 0.0864 0.0866 0.0812 0.0891 0.0994 0.1140 0.1380 0.1530 0.0896 0.0950 0.1091 0.1142 0.1251 0.1255 0.1263
va: 2.1337 2.0844 2.3073 3.7419 3.8285 3.8336 3.9098 3.9007 3.8965 4.1894 3.7328 3.9416 3.9438 3.8580 3.7003 4.0182 3.9638 3.7188 3.8670 3.6706 3.9909 3.9758 3.9610 3.9537 3.9552 1.0267 1.0327 1.0065 1.0008 1.0048 1.0018 1.0212 1.0027 1.0096 1.0098 0.9989 0.9987 1.0007 1.0194 1.0016 0.9960 1.0093 1.0072 1.0150 1.0111 1.0040 1.0113 1.0103 1.0003 1.0001 0.9996
dispcorr: -0.022785378 hartree
energy: -1079.755543897453
dipole: 24.87498 -25.02351 -0.14853 12.53982 -11.85925 0.68057 -5.08560 5.39669 0.31109
magnitude: 0.76290 au
magnitude: 1.93913 debye
