program: Gaussian 09
title: 000069519
version: EM64L-G09RevD.01
frameworkgroup: C1[X(C9H10O2)]
method: RPBEPBE
basis: SDD
operation: Freq
keyword: #pfreq=noraman
keyword: PBEPBE/SDD
title: #p freq=noraman PBEPBE/SDD
converged: YES YES NO NO
title: Mulliken charges:
elementType: O O C C C C C C C C C H H H H H H H H H H
charge: -0.416310 -0.225077 0.378036 0.316724 -0.659452 -0.405084 -0.403656 -0.833827 -0.239526 -0.232131 0.196734 0.255534 0.266193 0.230726 0.229941 0.270385 0.213213 0.226863 0.227549 0.226689 0.376476
chargesum: 0.00000
title: Mulliken charges with hydrogens summed into heavy atoms:
elementType: O O C C C C C C C C C
charge: -0.039834 -0.225077 0.378036 0.316724 -0.137725 -0.174358 -0.173716 -0.123365 -0.011976 -0.005443 0.196734
polarizability: 1.24429365e+02 8.76355182e-01 1.04577811e+02 -1.19840360e+01 2.66915560e+00 6.40805121e+01
1716.lowfreq: -10.8390 -8.2646 0.0009 0.0009 0.0011 2.9703 10.8644 65.9602 93.5295
frequency: 10.6015 65.9454 93.5169 135.7573 187.3787 273.5367 281.4249 341.9994 400.7567 442.4395 483.0345 512.1747 524.2419 574.0423 630.1245 652.8285 721.1627 746.2262 765.1480 840.1368 860.5516 876.1980 921.6044 949.6383 987.3909 989.0226 1041.3105 1047.9800 1050.7247 1113.0044 1173.6889 1179.4515 1192.4419 1232.9547 1253.9293 1291.1529 1339.4020 1378.0668 1397.1502 1432.0520 1445.5241 1473.5847 1482.6138 1490.3416 1591.4111 1616.8255 1671.7588 2973.9081 2986.5214 3054.8995 3066.2368 3085.5348 3115.1970 3121.4966 3139.2134 3160.9671 3510.5007
redmass: 5.9100 4.4524 5.0851 1.2276 2.6064 4.2759 3.0439 3.1580 2.7664 2.8997 2.2254 3.2609 4.2977 4.6247 2.6611 1.8245 3.7482 1.5535 2.4959 3.1763 3.3453 1.5695 2.0743 1.4696 1.3274 1.6112 2.5621 1.6598 1.9648 1.8186 1.0850 1.1609 2.1890 1.8957 1.9572 1.4110 1.9020 6.0352 1.2536 1.5952 1.3669 1.0553 1.4152 1.7698 6.5219 6.3614 8.2558 1.0385 1.0653 1.0956 1.0932 1.0989 1.0867 1.0887 1.0933 1.1008 1.0640
irintensity: 0.5218 0.5345 1.7337 1.2571 1.9878 1.4697 1.6192 3.6022 0.5979 5.4953 12.6853 8.2794 23.2808 27.1457 55.5001 93.2314 1.1090 53.5721 22.0612 15.2779 6.7737 1.8255 8.0790 1.6304 0.0213 1.8612 311.0321 9.1021 6.5735 25.2703 0.3624 1.6582 1.5875 0.3305 4.2762 8.1868 55.6706 1.9800 17.4427 7.7597 25.3881 28.7247 16.4374 18.8942 0.6440 2.1729 180.8563 32.9160 11.7405 14.8635 5.6392 17.4094 12.3165 3.9261 33.0788 28.5120 22.7207
temp: 298.150 k
press: 1.00000 atm
elementType: 8 8 6 6 6 6 6 6 6 6 6 1 1 1 1 1 1 1 1 1 1
symmnumber: 1
zpe: 438890.3 jmol-1
zpe.correction: 0.167164 hartree
zpe.thermalcorrener: 0.177596 hartree
zpe.thermalcorrenthalpy: 0.178540 hartree
zpe.thermalcorrgfe: 0.129266 hartree
zpe.sumelectzpe: -498.611222 hartree
zpe.sumelectthermal: -498.600790 hartree
zpe.sumelectthermalent: -498.599846 hartree
zpe.sumelectthermalfe: -498.649120 hartree
dipole: 0.4922 -0.2076 -1.1998
dipole: 1.3134
quadrupole: -55.2710 -59.7980 -69.7527
quadrupole: -0.6422 -1.3933 -2.3276
quadrupole: 6.3363 1.8092 -8.1455 -0.6422 -1.3933 -2.3276
hfenergy: -498.778386 hartree
pointgroup: C01 [X(C9H10O2)]
dipole: 0.1877895 -0.0055565 0.4813626 debye
dipolederiv: -1.2991282 -0.2607887 -0.3339878 -0.2710111 -0.4773213 -0.0380328 -0.1967999 -0.0192731 -0.3315262 -0.6863578 -0.0379614 0.0717713 -0.1668494 -0.3811186 -0.154938 -0.1208784 -0.2177159 -0.855292 0.2605905 -0.0029984 0.0324438 0.076441 -0.1144324 -0.0079378 0.0831593 -0.0107204 -0.0806643 0.0140591 -0.1934486 -0.0154004 -0.1518619 0.2604207 -0.0055217 -0.0567874 0.0054874 -0.0224666 -0.1090093 -0.015249 0.1086655 -0.0172726 0.1144964 0.0067236 0.252942 -0.0167085 -0.1457529 -0.0793346 0.0511536 0.0648562 0.0243759 0.037319 0.0417436 0.0358177 0.0408926 -0.1293969 -0.0734286 0.1595307 0.0598788 0.0776891 -0.0276374 0.05178 0.0551648 0.0856229 -0.1388638 -0.03362 0.1483903 0.0333448 0.0653133 -0.0873369 -0.0034234 0.0366332 -0.0128228 0.0482129 -0.0704804 -0.0772002 0.0230271 -0.0693928 0.0411626 0.0109002 0.0198509 0.0078636 -0.1542311 0.0766179 -0.0117502 0.0796269 0.0020167 -0.0153007 0.0214955 0.0784777 0.0177695 -0.1209469 1.6364667 0.3191614 0.0665029 0.3969334 0.3641714 0.2897112 0.020741 0.3039533 1.092341 0.0219438 0.0303531 0.0024149 0.0823458 0.004695 0.101686 -0.0256819 0.0571323 0.0621798 0.0391938 -0.014203 -0.0023516 -0.0540985 -0.0169147 -0.1080084 -0.0280184 -0.0496966 0.0744887 0.030811 -0.1015445 -0.0638771 -0.0780588 -0.0478147 -0.0502826 -0.0550594 -0.0655797 0.1163319 0.0408057 -0.0618834 -0.0427144 -0.0951131 -0.0727038 -0.0633732 -0.0531512 -0.0573187 0.1251475 0.0022079 0.0576559 0.0879981 0.0516894 0.0743018 0.0215449 0.0930969 -0.0248401 0.0311089 0.050085 0.0581713 -0.1003943 0.0502055 0.0289953 0.0022458 -0.1083124 0.0827597 -0.0915492 -0.0261832 -0.1699883 -0.0453039 -0.0624888 -0.0450537 -0.0266718 -0.0425815 -0.0512714 0.0985519 0.0348687 0.0905224 -0.0221483 0.1034565 -0.084496 -0.0102835 -0.0250016 -0.0138572 0.1521029 -0.1157902 0.0240221 -0.0820208 0.0163764 0.0840569 -0.006405 -0.0860668 -0.0035585 0.1311824 0.2856821 0.0080549 0.0776684 0.0193041 0.3605111 -0.0729525 0.1224553 -0.0581186 0.1390421 unknown
polarizability: 123.9359118|-3.668969|102.7164467|12.6357746|8.8835968|66.43533 unknown
InChI: InChI=1S/C9H10O2/c1-7-4-2-3-5-8(7)6-9(10)11/h2-5,10H,6H2,1H3
charge 0 multiplicity 1
21 atoms
O  3.565982 0.474846 0.284292
O  2.144492 -0.390377 -1.332199
C  -0.164436 0.186803 0.481929
C  -0.853655 -0.990526 0.062176
C  1.28154 0.142644 0.951217
C  -0.837839 1.432934 0.471329
C  -2.204115 -0.870946 -0.352861
C  -0.174261 -2.348569 0.041635
C  -2.181502 1.537597 0.04947
C  -2.868481 0.375736 -0.364867
C  2.309585 0.035058 -0.170601
H  1.46185 -0.726897 1.615668
H  1.53462 1.036239 1.54705
H  -0.301634 2.332718 0.798087
H  -2.740368 -1.772032 -0.67423
H  0.638366 -2.367566 -0.707337
H  0.27218 -2.606159 1.021863
H  -0.893298 -3.145072 -0.214224
H  -2.683835 2.511112 0.047457
H  -3.91227 0.437347 -0.692837
H  4.231881 0.36901 -0.448819
