program: Gaussian 09
title: 000069518
version: EM64L-G09RevD.01
frameworkgroup: C1[X(C16H16N2O2)]
method: RPBEPBE
basis: SDD
operation: Freq
keyword: #p
keyword: freq=noraman
keyword: PBEPBE/SDD
title: #p freq=noraman PBEPBE/SDD
converged: YES YES NO NO
title: Mulliken charges:
elementType: O O N N C C C C C C C C C C C C C C C C H H H H H H H H H H H H H H H H
charge: -0.289487 -0.289358 -0.384100 -0.383958 -0.377274 -0.377374 0.169454 0.169029 0.271059 0.271335 -0.350059 -0.350234 -0.358728 -0.359242 -0.221597 -0.221565 -0.237838 -0.237724 -0.227116 -0.227108 0.249248 0.257806 0.257928 0.249263 0.312140 0.312244 0.275946 0.275849 0.214217 0.214586 0.232991 0.232987 0.230222 0.230230 0.233118 0.233110
chargesum: 0.00000
title: Mulliken charges with hydrogens summed into heavy atoms:
elementType: O O N N C C C C C C C C C C C C C C C C
charge: -0.289487 -0.289358 -0.071960 -0.071715 0.129780 0.129816 0.169454 0.169029 0.271059 0.271335 -0.074113 -0.074384 -0.144512 -0.144656 0.011394 0.011422 -0.007616 -0.007494 0.006002 0.006002
polarizability: 2.33048658e+02 1.17898803e-01 2.11644533e+02 -3.43018536e+01 3.90860209e-02 1.17874941e+02
1716.lowfreq: -13.1915 -4.5910 -3.2280 -0.0008 -0.0007 -0.0005 9.0912 18.7714 21.3148
frequency: 8.8469 18.7455 21.1337 44.2823 53.0332 65.2053 87.2518 135.5650 145.5020 177.6869 199.9199 257.5758 290.5578 304.2220 328.7246 369.8650 399.8174 402.3679 407.1549 431.1490 486.5861 487.4274 494.2928 540.2369 557.8310 614.0698 614.2912 655.1582 671.7057 688.4831 690.6524 703.9482 704.1304 787.3093 791.4503 799.0610 818.5609 854.8681 855.9191 875.2654 878.8512 934.3064 935.6294 984.0061 984.5684 989.1366 989.1929 1005.5264 1005.5954 1016.1312 1018.2363 1043.3499 1043.7638 1081.9609 1083.6471 1106.4181 1147.6095 1163.5206 1173.3000 1173.4716 1190.3746 1191.8433 1241.4265 1275.3967 1283.6590 1296.7338 1316.5681 1318.0282 1340.5418 1364.1655 1384.1658 1384.1934 1430.4554 1431.6410 1446.1858 1446.5074 1472.0849 1472.1714 1502.6262 1503.0658 1568.3160 1569.4819 1603.8619 1604.5382 1610.6290 1610.6522 3008.6603 3018.6528 3088.9336 3106.2619 3115.3750 3115.8653 3131.4575 3131.5065 3144.3436 3144.4182 3157.6542 3157.6953 3169.2608 3169.3326 3573.6223 3573.8583
redmass: 5.9172 4.5606 4.0203 5.8599 5.9136 5.2573 5.6826 4.1727 4.9380 3.1115 3.9449 4.9052 4.3131 4.0446 4.5427 3.4313 2.9096 2.8157 3.8254 4.2395 4.2682 2.3758 1.6965 2.4606 1.2159 6.3935 6.2672 5.5050 5.6647 4.9621 4.4100 1.5168 1.5089 2.4150 2.6313 3.5968 3.4935 1.2623 1.2665 2.5411 3.3110 1.4400 1.4443 1.4101 1.4034 5.5933 5.7085 1.3444 1.3440 3.2009 2.9288 2.1771 2.4388 1.6022 1.5771 2.4114 2.9442 3.0795 1.0586 1.0647 1.1455 1.1717 1.2616 1.6747 2.1496 1.3718 1.3344 1.3483 1.2352 1.2717 9.1336 9.1027 2.0869 2.1168 1.3710 1.2305 1.8389 1.8736 1.9916 1.9764 6.5154 5.9382 6.6327 6.3399 6.0861 6.0855 1.0624 1.0632 1.1017 1.1015 1.0874 1.0874 1.0869 1.0869 1.0920 1.0920 1.0956 1.0956 1.1006 1.1007 1.0781 1.0779
irintensity: 0.2715 1.1692 2.2794 2.5858 7.7675 12.8319 0.6179 0.4007 3.1458 4.5128 2.8348 1.8246 37.2080 0.6951 3.2140 0.6079 1.3411 0.3489 0.4271 6.3497 4.8662 61.6866 82.3715 39.6063 53.4706 0.2457 1.1019 9.0421 7.3824 2.7837 6.6812 147.3522 62.0122 46.0038 0.6088 7.5963 1.5243 2.5920 0.0351 19.0451 0.7717 5.0837 0.6809 2.0593 0.1134 0.4964 0.1939 2.6684 0.6276 5.4548 4.9255 3.5180 3.0592 0.0141 32.9453 2.7279 6.3017 0.8337 0.9884 0.5302 9.1578 2.6115 20.8882 34.2041 141.3491 65.0992 2.0042 9.5561 20.7430 26.8558 1.9918 0.5068 2.9597 3.1565 0.8291 143.5703 62.9047 68.1352 74.4500 298.2475 134.3816 61.8674 66.1595 39.6579 3.3668 5.2746 11.1623 45.2915 2.7193 8.4834 23.7626 3.7440 1.6145 1.9879 45.2612 1.2768 7.6986 21.8595 24.2220 16.9195 25.8564 3.9319
temp: 298.150 k
press: 1.00000 atm
elementType: 8 8 7 7 6 6 6 6 6 6 6 6 6 6 6 6 6 6 6 6 1 1 1 1 1 1 1 1 1 1 1 1 1 1 1 1
symmnumber: 1
zpe: 755228.2 jmol-1
zpe.correction: 0.287651 hartree
zpe.thermalcorrener: 0.305638 hartree
zpe.thermalcorrenthalpy: 0.306582 hartree
zpe.thermalcorrgfe: 0.236863 hartree
zpe.sumelectzpe: -877.862251 hartree
zpe.sumelectthermal: -877.844265 hartree
zpe.sumelectthermalent: -877.843321 hartree
zpe.sumelectthermalfe: -877.913039 hartree
dipole: 0.0041 4.5442 0.0007
dipole: 4.5442
quadrupole: -110.1543 -113.3129 -119.3141
quadrupole: 0.0103 6.0007 0.0101
quadrupole: 4.1061 0.9475 -5.0537 0.0103 6.0007 0.0101
hfenergy: -878.1499027 hartree
pointgroup: C01 [X(C16H16N2O2)]
dipole: -0.0062339 1.7878155 0.0011324 debye
polarizability: 233.781683|-0.0337713|211.6442145|-33.0408314|-0.0503085|117.1422356 unknown
InChI: InChI=1S/C16H16N2O2/c19-15(13-7-3-1-4-8-13)17-11-12-18-16(20)14-9-5-2-6-10-14/h1-10,17-18H,11-12H2
charge 0 multiplicity 1
36 atoms
O  -2.693289 -2.05422 0.975307
O  2.706612 -2.038932 -0.977193
N  -1.303853 -1.356431 -0.74351
N  1.311648 -1.350407 0.741042
C  -0.433915 -2.537789 -0.639256
C  0.448312 -2.536393 0.634979
C  -2.390943 -1.182516 0.094574
C  2.398513 -1.169753 -0.095951
C  -3.203707 0.0753 -0.092182
C  3.203815 0.092467 0.092943
C  -4.519457 0.083995 0.437156
C  4.521883 0.108035 -0.430369
C  -2.709523 1.239978 -0.73756
C  2.699938 1.255007 0.734694
C  -5.337108 1.22496 0.302932
C  5.332439 1.253753 -0.293442
C  -3.527088 2.384445 -0.867471
C  3.51038 2.404213 0.867205
C  -4.844577 2.378033 -0.353423
C  4.830316 2.404674 0.359417
H  -1.059484 -3.449412 -0.610849
H  0.215212 -2.574911 -1.528847
H  -0.200547 -2.578656 1.524515
H  1.079002 -3.444426 0.604929
H  -1.127004 -0.686186 -1.490919
H  1.131059 -0.682035 1.489248
H  -4.871166 -0.815328 0.953282
H  4.881133 -0.789688 -0.944081
H  -1.679728 1.28284 -1.1139
H  1.668038 1.29217 1.105826
H  -6.354349 1.21829 0.709356
H  6.351599 1.252435 -0.695084
H  -3.135336 3.280737 -1.360863
H  3.111239 3.298852 1.357671
H  -5.477878 3.266147 -0.456495
H  5.458114 3.29645 0.464516
