program: Orca
programVersion: 5.0.2
elementType: O O O C C C C C C C C C C C C C C C C C C C C C C H H H H H H H H H H H H H H H H H H H H H H H H H H
charge: 0
multiplicity: 1
keywords: wb97x-d3
keywords: def2-TZVPP
keywords: def2/J RIJCOSX
keywords: DEFGRID2
keywords: scfconv7
keywords: smallprint printgap noloewdin
keywords: NOSOSCF
formula: C22H26O3
InChI: InChI=1/C22H26O3/c1-15(2)10-19-20(22(19,3)4)21(23)25-14-17-12-18(24-13-17)11-16-8-6-5-7-9-16/h5-10,12-13,19-20H,11,14H2,1-4H3
51 atoms
O  1.907553 -2.359193 0.3662
O  1.470834 -1.765253 -1.747045
O  -2.399972 -2.613618 -0.244329
C  1.402731 1.033512 -0.274609
C  2.570763 0.939616 -1.213153
C  2.351628 -0.156484 -0.212304
C  1.478285 1.99185 0.887858
C  0.004348 0.876902 -0.820877
C  3.760861 1.821647 -1.093206
C  1.874646 -1.485256 -0.649761
C  3.819694 3.078944 -1.533357
C  5.066965 3.898905 -1.403575
C  2.664971 3.767038 -2.195186
C  1.110026 -3.536131 0.215392
C  -0.327526 -3.168578 0.313295
C  -0.990072 -2.620628 1.457608
C  -1.238191 -3.128606 -0.685298
C  -2.240965 -2.296342 1.058719
C  -3.359957 -1.581582 1.729169
C  -3.355392 -0.113567 1.370377
C  -2.751126 0.816271 2.208797
C  -3.900646 0.324689 0.1681
C  -2.691005 2.156405 1.856304
C  -3.840656 1.663117 -0.188388
C  -3.234395 2.58348 0.654336
H  2.303648 0.659606 -2.229316
H  2.998399 -0.172514 0.65918
H  1.183064 2.995557 0.574207
H  2.480848 2.06385 1.307494
H  0.796559 1.679295 1.680893
H  -0.040386 0.233665 -1.696418
H  -0.388012 1.855267 -1.106608
H  -0.672536 0.470196 -0.066441
H  4.646219 1.393927 -0.630891
H  5.872356 3.346424 -0.920912
H  5.425825 4.227739 -2.382274
H  4.882514 4.804611 -0.820009
H  2.910955 4.030132 -3.227368
H  1.763896 3.156993 -2.211668
H  2.427571 4.704504 -1.686097
H  1.413825 -4.186065 1.035564
H  1.328636 -4.047653 -0.723406
H  -0.572489 -2.466497 2.439754
H  -1.188049 -3.404077 -1.725743
H  -3.250487 -1.702642 2.807918
H  -4.31634 -2.036321 1.458489
H  -2.320311 0.489256 3.14798
H  -4.372398 -0.387512 -0.497809
H  -2.219272 2.867553 2.521804
H  -4.269847 1.988237 -1.127112
H  -3.187853 3.628207 0.376715
totalener: -1079.72964714 hartree
nucrepener: 2207.64505363 hartree
electener: -3287.37470076 hartree
oneelecener: -5853.81494933 hartree
twoeener: 2566.44024856 hartree
kineticenergy: 1074.92104207 hartree
xcener: -106.468512536155 hartree
chargesum: -0.0000000
charge: -0.267395 -0.378828 -0.252733 0.125787 -0.028598 -0.087935 -0.257671 -0.248090 -0.196546 0.322411 -0.021932 -0.211484 -0.241442 0.067864 -0.061218 -0.285628 0.005134 0.221589 -0.136424 0.072917 -0.154201 -0.144247 -0.132860 -0.121388 -0.137043 0.107920 0.077304 0.083623 0.085036 0.089073 0.103475 0.081713 0.057330 0.087024 0.079034 0.085242 0.082992 0.097770 0.083151 0.084707 0.103831 0.104962 0.122288 0.140534 0.095519 0.110134 0.102418 0.111852 0.124636 0.123823 0.124567
qa: -0.2674 -0.3788 -0.2527 0.1258 -0.0286 -0.0879 -0.2577 -0.2481 -0.1965 0.3224 -0.0219 -0.2115 -0.2414 0.0679 -0.0612 -0.2856 0.0051 0.2216 -0.1364 0.0729 -0.1542 -0.1442 -0.1329 -0.1214 -0.1370 0.1079 0.0773 0.0836 0.0850 0.0891 0.1035 0.0817 0.0573 0.0870 0.0790 0.0852 0.0830 0.0978 0.0832 0.0847 0.1038 0.1050 0.1223 0.1405 0.0955 0.1101 0.1024 0.1119 0.1246 0.1238 0.1246
va: 2.1100 2.1263 2.2993 3.6853 3.8277 3.8424 3.9081 3.9060 3.8620 4.2964 3.7326 3.9391 3.9340 3.8998 3.7066 4.0230 3.9737 3.6044 3.8756 3.6231 3.9475 3.9855 3.9272 3.9482 3.9270 1.0258 1.0344 1.0020 1.0098 1.0087 1.0260 1.0064 1.0089 1.0133 1.0105 0.9979 0.9989 1.0027 1.0125 0.9996 0.9909 1.0099 1.0205 1.0115 1.0141 1.0108 1.0126 1.0184 1.0005 1.0005 1.0002
dispcorr: -0.028142927 hartree
energy: -1079.757790062639
dipole: 12.26776 -12.43032 -0.16256 24.39650 -23.94745 0.44905 -2.21041 2.89688 0.68647
magnitude: 0.83625 au
magnitude: 2.12557 debye
