program: Orca
programVersion: 5.0.2
elementType: O O O C C C C C C C C C C C C C C C C C C C C C C H H H H H H H H H H H H H H H H H H H H H H H H H H
charge: 0
multiplicity: 1
keywords: wb97x-d3
keywords: def2-TZVPP
keywords: def2/J RIJCOSX
keywords: DEFGRID2
keywords: scfconv7
keywords: smallprint printgap noloewdin
keywords: NOSOSCF
formula: C22H26O3
InChI: InChI=1/C22H26O3/c1-15(2)10-19-20(22(19,3)4)21(23)25-14-17-12-18(24-13-17)11-16-8-6-5-7-9-16/h5-10,12-13,19-20H,11,14H2,1-4H3
51 atoms
O  1.553184 -1.778525 -0.920302
O  2.276853 -2.021791 1.182509
O  -2.062623 -2.494447 1.419353
C  1.914798 1.235011 -0.158086
C  2.853812 0.768229 -1.234487
C  2.766342 -0.004192 0.054196
C  2.294792 2.446349 0.657677
C  0.426701 1.118926 -0.382366
C  4.103675 1.501476 -1.559391
C  2.186019 -1.36167 0.181234
C  4.222882 2.428609 -2.510817
C  5.534326 3.098623 -2.788596
C  3.082136 2.871453 -3.376073
C  0.793936 -2.987927 -0.81187
C  -0.511378 -2.735883 -0.146107
C  -1.689605 -2.175209 -0.734244
C  -0.807681 -2.901595 1.164422
C  -2.596325 -2.049136 0.262871
C  -3.964243 -1.473723 0.314698
C  -4.005054 -0.150451 1.045096
C  -4.763227 0.011415 2.196435
C  -3.270041 0.931937 0.569893
C  -4.792756 1.230571 2.860587
C  -3.296526 2.149439 1.228946
C  -4.060274 2.30305 2.378507
H  2.36485 0.296622 -2.081133
H  3.582827 0.135914 0.755261
H  2.012263 3.362389 0.134827
H  3.365307 2.501599 0.850425
H  1.779939 2.437551 1.619769
H  -0.105117 0.979874 0.561079
H  0.156478 0.29366 -1.036855
H  0.053104 2.038967 -0.838189
H  4.985474 1.24776 -0.977827
H  5.45602 4.182241 -2.669959
H  6.323434 2.744343 -2.126371
H  5.856816 2.920895 -3.817836
H  2.953275 3.955138 -3.318499
H  3.275902 2.63909 -4.426508
H  2.135347 2.411219 -3.099302
H  1.366161 -3.753911 -0.287558
H  0.649103 -3.317845 -1.840038
H  -1.836041 -1.901256 -1.767346
H  -0.231314 -3.269552 1.997089
H  -4.656157 -2.177456 0.785158
H  -4.311355 -1.342539 -0.712862
H  -5.334473 -0.824125 2.582959
H  -2.663112 0.816258 -0.320708
H  -5.386302 1.33881 3.758959
H  -2.718509 2.980436 0.84584
H  -4.080527 3.253029 2.895978
totalener: -1079.72919801 hartree
nucrepener: 2146.41489471 hartree
electener: -3226.14409272 hartree
oneelecener: -5730.99246509 hartree
twoeener: 2504.84837237 hartree
kineticenergy: 1074.91164637 hartree
xcener: -106.466415715813 hartree
chargesum: 0.0000000
charge: -0.266068 -0.373394 -0.246470 0.150927 0.013735 -0.126581 -0.244719 -0.333229 -0.217027 0.347096 -0.023962 -0.212614 -0.235965 0.038598 -0.048820 -0.347029 0.006356 0.250063 -0.125213 0.073750 -0.144381 -0.188051 -0.121347 -0.127590 -0.128542 0.097883 0.079217 0.083240 0.080548 0.097412 0.114674 0.090123 0.089201 0.089823 0.083728 0.079188 0.085820 0.084458 0.093406 0.078413 0.114233 0.099777 0.132097 0.151266 0.093693 0.109458 0.105240 0.127005 0.123377 0.122710 0.124489
qa: -0.2661 -0.3734 -0.2465 0.1509 0.0137 -0.1266 -0.2447 -0.3332 -0.2170 0.3471 -0.0240 -0.2126 -0.2360 0.0386 -0.0488 -0.3470 0.0064 0.2501 -0.1252 0.0737 -0.1444 -0.1881 -0.1213 -0.1276 -0.1285 0.0979 0.0792 0.0832 0.0805 0.0974 0.1147 0.0901 0.0892 0.0898 0.0837 0.0792 0.0858 0.0845 0.0934 0.0784 0.1142 0.0998 0.1321 0.1513 0.0937 0.1095 0.1052 0.1270 0.1234 0.1227 0.1245
va: 2.1024 2.1285 2.3180 3.7145 3.7652 3.9158 3.9005 3.9166 3.8711 4.2725 3.7385 3.9420 3.9434 3.8904 3.6519 4.0140 3.9905 3.5853 3.8783 3.6586 3.9995 3.9805 3.9613 3.9632 3.9663 1.0216 1.0345 1.0040 1.0084 1.0046 0.9944 1.0139 0.9992 1.0149 0.9988 1.0110 0.9975 1.0006 1.0006 1.0107 1.0100 0.9958 1.0155 1.0130 1.0136 1.0038 1.0116 0.9974 1.0007 1.0025 0.9998
dispcorr: -0.025774879 hartree
energy: -1079.754972889909
dipole: 14.06237 -14.46301 -0.40064 22.47914 -21.87401 0.60513 -12.08128 11.21879 -0.86249
magnitude: 1.12720 au
magnitude: 2.86512 debye
