program: Orca
programVersion: 5.0.2
elementType: O O O C C C C C C C C C C C C C C C C C C C C C C H H H H H H H H H H H H H H H H H H H H H H H H H H
charge: 0
multiplicity: 1
keywords: wb97x-d3
keywords: def2-TZVPP
keywords: def2/J RIJCOSX
keywords: DEFGRID2
keywords: scfconv7
keywords: smallprint printgap noloewdin
keywords: NOSOSCF
formula: C22H26O3
InChI: InChI=1/C22H26O3/c1-15(2)10-19-20(22(19,3)4)21(23)25-14-17-12-18(24-13-17)11-16-8-6-5-7-9-16/h5-10,12-13,19-20H,11,14H2,1-4H3
51 atoms
O  1.524579 -1.765609 -1.016631
O  2.378057 -2.004925 1.037209
O  -1.93242 -2.498674 1.531024
C  1.849154 1.247077 -0.23192
C  2.722366 0.823738 -1.380445
C  2.749355 0.031286 -0.101009
C  2.250709 2.457565 0.574711
C  0.352294 1.084452 -0.345515
C  3.926142 1.595841 -1.77864
C  2.211518 -1.340433 0.048886
C  3.970747 2.498454 -2.759566
C  5.242391 3.210909 -3.107978
C  2.779653 2.870796 -3.589507
C  0.788375 -2.984307 -0.866085
C  -0.478404 -2.746016 -0.124334
C  -1.701141 -2.21702 -0.64754
C  -0.688832 -2.890489 1.205171
C  -2.545143 -2.085377 0.402151
C  -3.913225 -1.521626 0.533955
C  -3.901611 -0.187379 1.243721
C  -3.315113 0.918321 0.635449
C  -4.439334 -0.044206 2.515303
C  -3.270957 2.141558 1.282574
C  -4.396316 1.180348 3.16849
C  -3.812523 2.276097 2.554155
H  2.18842 0.349499 -2.197546
H  3.609485 0.185753 0.542313
H  1.815845 2.413404 1.574533
H  1.893916 3.370714 0.094461
H  3.330554 2.549819 0.681822
H  -0.099141 0.887869 0.628829
H  0.058672 0.27666 -1.011485
H  -0.088575 2.006965 -0.73027
H  4.839894 1.395088 -1.226366
H  5.525346 3.02717 -4.147653
H  5.129069 4.292803 -3.003101
H  6.073047 2.897822 -2.476669
H  1.863038 2.388195 -3.256832
H  2.613372 3.950052 -3.562242
H  2.937047 2.608739 -4.63878
H  1.399186 -3.743701 -0.377206
H  0.586487 -3.315333 -1.884107
H  -1.916073 -1.964315 -1.67405
H  -0.056091 -3.232661 2.007214
H  -4.565321 -2.220682 1.064179
H  -4.329898 -1.410169 -0.469289
H  -2.878798 0.816723 -0.3517
H  -4.892534 -0.898139 3.004335
H  -2.810725 2.991492 0.795484
H  -4.817419 1.274883 4.160901
H  -3.777593 3.230545 3.062551
totalener: -1079.72922521 hartree
nucrepener: 2152.58218312 hartree
electener: -3232.31140833 hartree
oneelecener: -5743.35910886 hartree
twoeener: 2511.04770053 hartree
kineticenergy: 1074.91974990 hartree
xcener: -106.467943006649 hartree
chargesum: 0.0000000
charge: -0.265919 -0.373253 -0.247163 0.162220 0.015617 -0.129239 -0.243217 -0.330991 -0.219283 0.344560 -0.022530 -0.212307 -0.237945 0.039043 -0.052317 -0.343428 0.006743 0.248446 -0.128855 0.092624 -0.197044 -0.146047 -0.119360 -0.121789 -0.129442 0.097126 0.078129 0.097403 0.082811 0.079171 0.117143 0.087631 0.085892 0.088843 0.085203 0.083832 0.079254 0.078624 0.084366 0.092757 0.115134 0.099189 0.130024 0.152239 0.095888 0.109561 0.115855 0.105219 0.121600 0.123615 0.124364
qa: -0.2659 -0.3733 -0.2472 0.1622 0.0156 -0.1292 -0.2432 -0.3310 -0.2193 0.3446 -0.0225 -0.2123 -0.2379 0.0390 -0.0523 -0.3434 0.0067 0.2484 -0.1289 0.0926 -0.1970 -0.1460 -0.1194 -0.1218 -0.1294 0.0971 0.0781 0.0974 0.0828 0.0792 0.1171 0.0876 0.0859 0.0888 0.0852 0.0838 0.0793 0.0786 0.0844 0.0928 0.1151 0.0992 0.1300 0.1522 0.0959 0.1096 0.1159 0.1052 0.1216 0.1236 0.1244
va: 2.1023 2.1281 2.3160 3.7108 3.7571 3.9230 3.9002 3.9221 3.8793 4.2737 3.7371 3.9416 3.9453 3.8889 3.6574 4.0163 3.9858 3.5885 3.8773 3.6178 3.9819 4.0095 3.9514 3.9605 3.9671 1.0215 1.0352 1.0044 1.0048 1.0086 0.9922 1.0142 1.0013 1.0154 0.9976 0.9987 1.0110 1.0107 1.0006 1.0001 1.0099 0.9958 1.0161 1.0126 1.0130 1.0060 1.0043 1.0119 1.0019 1.0006 0.9996
dispcorr: -0.025904528 hartree
energy: -1079.755129740836
dipole: 12.68887 -13.17166 -0.48280 22.55008 -21.94628 0.60381 -12.69165 11.87781 -0.81384
magnitude: 1.12250 au
magnitude: 2.85317 debye
