program: Orca
programVersion: 5.0.2
elementType: O O O C C C C C C C C C C C C C C C C C C C C C C H H H H H H H H H H H H H H H H H H H H H H H H H H
charge: 0
multiplicity: 1
keywords: wb97x-d3
keywords: def2-TZVPP
keywords: def2/J RIJCOSX
keywords: DEFGRID2
keywords: scfconv7
keywords: smallprint printgap noloewdin
keywords: NOSOSCF
formula: C22H26O3
InChI: InChI=1/C22H26O3/c1-15(2)10-19-20(22(19,3)4)21(23)25-14-17-12-18(24-13-17)11-16-8-6-5-7-9-16/h5-10,12-13,19-20H,11,14H2,1-4H3
51 atoms
O  1.158562 -0.427464 1.137793
O  1.989615 -1.596726 -0.579438
O  -2.315206 -2.358103 -0.773801
C  2.649392 1.260851 -1.688753
C  3.880666 0.637519 -1.103122
C  2.607577 0.693987 -0.282165
C  2.556396 2.764642 -1.798742
C  1.960042 0.550367 -2.828405
C  5.055391 1.423046 -0.682981
C  1.905315 -0.567417 0.040844
C  6.338234 1.141634 -0.924066
C  7.427811 2.042047 -0.421032
C  6.823915 -0.051885 -1.689685
C  0.39428 -1.56436 1.553904
C  -0.863355 -1.717352 0.773328
C  -2.124585 -1.087619 1.025367
C  -1.049401 -2.472296 -0.334578
C  -2.967405 -1.515062 0.056158
C  -4.399411 -1.245905 -0.253721
C  -5.015714 -0.283359 0.723684
C  -5.882243 -0.728263 1.714066
C  -4.715885 1.074384 0.658441
C  -6.440836 0.161862 2.620565
C  -5.268183 1.966235 1.563691
C  -6.135341 1.511666 2.547586
H  4.090505 -0.353162 -1.49047
H  2.575726 1.436594 0.507661
H  2.981611 3.283707 -0.94092
H  1.513493 3.074776 -1.883224
H  3.081886 3.11541 -2.688715
H  2.368516 0.904084 -3.77698
H  0.889232 0.763924 -2.830377
H  2.083951 -0.528798 -2.792936
H  4.845731 2.322184 -0.110714
H  8.110665 1.502092 0.239873
H  8.033135 2.426825 -1.245812
H  7.034828 2.895014 0.131069
H  6.025204 -0.691782 -2.056535
H  7.416489 0.261224 -2.552734
H  7.481091 -0.665567 -1.068876
H  0.169189 -1.375069 2.602875
H  1.001193 -2.468988 1.497086
H  -2.367662 -0.410876 1.828494
H  -0.387291 -3.104588 -0.902386
H  -4.959356 -2.186028 -0.252572
H  -4.483896 -0.848811 -1.270909
H  -6.124276 -1.782389 1.778129
H  -4.039309 1.434384 -0.107601
H  -7.116775 -0.201196 3.383645
H  -5.024931 3.018679 1.498408
H  -6.571154 2.20726 3.252597
totalener: -1079.73411248 hartree
nucrepener: 2045.77531706 hartree
electener: -3125.50942953 hartree
oneelecener: -5529.87132553 hartree
twoeener: 2404.36189600 hartree
kineticenergy: 1074.90292772 hartree
xcener: -106.466887751813 hartree
chargesum: -0.0000000
charge: -0.263693 -0.408467 -0.255403 0.086840 0.042329 -0.096749 -0.247586 -0.258172 -0.184980 0.365793 -0.052186 -0.203562 -0.236018 0.061911 -0.091771 -0.243519 0.006442 0.165448 -0.053972 0.031662 -0.147027 -0.188403 -0.121728 -0.113906 -0.132470 0.088522 0.070364 0.070416 0.090581 0.092105 0.084538 0.085713 0.098429 0.070018 0.084036 0.083552 0.075940 0.083710 0.084591 0.085513 0.100728 0.112613 0.138604 0.149753 0.086368 0.100765 0.108369 0.117929 0.124411 0.125764 0.125853
qa: -0.2637 -0.4085 -0.2554 0.0868 0.0423 -0.0967 -0.2476 -0.2582 -0.1850 0.3658 -0.0522 -0.2036 -0.2360 0.0619 -0.0918 -0.2435 0.0064 0.1654 -0.0540 0.0317 -0.1470 -0.1884 -0.1217 -0.1139 -0.1325 0.0885 0.0704 0.0704 0.0906 0.0921 0.0845 0.0857 0.0984 0.0700 0.0840 0.0836 0.0759 0.0837 0.0846 0.0855 0.1007 0.1126 0.1386 0.1498 0.0864 0.1008 0.1084 0.1179 0.1244 0.1258 0.1259
va: 2.1384 2.0923 2.3063 3.7381 3.7816 3.8854 3.9160 3.9138 3.9026 4.2133 3.8279 3.9344 3.9455 3.8674 3.6929 4.0137 3.9709 3.7067 3.8574 3.6565 3.9885 3.9805 3.9622 3.9466 3.9591 1.0354 1.0378 1.0112 1.0041 1.0039 1.0009 1.0025 1.0230 1.0218 0.9982 0.9981 1.0124 1.0161 0.9993 0.9990 0.9949 1.0093 1.0084 1.0152 1.0123 1.0031 1.0114 1.0089 1.0007 0.9998 0.9998
dispcorr: -0.021850623 hartree
energy: -1079.755963099203
dipole: 26.65453 -26.75827 -0.10375 13.67372 -13.09631 0.57741 -8.86260 9.13707 0.27447
magnitude: 0.64769 au
magnitude: 1.64629 debye
