program: Orca
programVersion: 5.0.2
elementType: O O O C C C C C C C C C C C C C C C C C C C C C C H H H H H H H H H H H H H H H H H H H H H H H H H H
charge: 0
multiplicity: 1
keywords: wb97x-d3
keywords: def2-TZVPP
keywords: def2/J RIJCOSX
keywords: DEFGRID2
keywords: scfconv7
keywords: smallprint printgap noloewdin
keywords: NOSOSCF
formula: C22H26O3
InChI: InChI=1/C22H26O3/c1-15(2)10-19-20(22(19,3)4)21(23)25-14-17-12-18(24-13-17)11-16-8-6-5-7-9-16/h5-10,12-13,19-20H,11,14H2,1-4H3
51 atoms
O  1.178272 -0.561467 0.881316
O  1.909428 -1.598368 -0.961185
O  -2.45653 -1.993737 -1.14288
C  2.758473 1.293697 -1.796808
C  3.947256 0.547855 -1.272256
C  2.674703 0.607799 -0.446637
C  2.748989 2.804331 -1.769844
C  2.03436 0.730611 -2.995963
C  5.167035 1.215976 -0.78733
C  1.898965 -0.633573 -0.239026
C  6.426888 0.802664 -0.946471
C  7.569955 1.602387 -0.394639
C  6.835762 -0.450014 -1.660775
C  0.346977 -1.68477 1.191869
C  -0.934662 -1.663292 0.435191
C  -2.159913 -1.034713 0.827059
C  -1.18411 -2.223425 -0.772042
C  -3.047974 -1.271144 -0.166377
C  -4.477523 -0.904075 -0.365922
C  -5.039926 -0.200665 0.838581
C  -5.433718 -0.928016 1.957782
C  -5.150769 1.183842 0.869369
C  -5.931156 -0.28607 3.080593
C  -5.650327 1.83095 1.990625
C  -6.041292 1.097251 3.099699
H  4.096861 -0.415362 -1.746603
H  2.684661 1.276127 0.407203
H  1.724825 3.175708 -1.832524
H  3.301834 3.20553 -2.621119
H  3.189082 3.221423 -0.865202
H  0.979783 1.013382 -2.982536
H  2.087404 -0.353181 -3.053782
H  2.473078 1.137155 -3.909208
H  5.016501 2.140629 -0.238259
H  8.158426 1.012504 0.312845
H  8.255262 1.90831 -1.189427
H  7.232888 2.501582 0.119684
H  7.403965 -1.1030 -0.993737
H  6.00087 -1.027324 -2.050321
H  7.495021 -0.21695 -2.500655
H  0.156318 -1.599227 2.260985
H  0.88919 -2.615363 1.019746
H  -2.350206 -0.485345 1.73496
H  -0.566705 -2.783841 -1.454145
H  -5.06094 -1.805785 -0.578366
H  -4.577859 -0.267464 -1.250512
H  -5.347207 -2.008059 1.9492
H  -4.843532 1.763035 0.00687
H  -6.235871 -0.866298 3.941728
H  -5.734613 2.909672 1.996207
H  -6.433178 1.599582 3.974219
totalener: -1079.73399354 hartree
nucrepener: 2041.77810140 hartree
electener: -3121.51209494 hartree
oneelecener: -5521.89308007 hartree
twoeener: 2400.38098513 hartree
kineticenergy: 1074.90624925 hartree
xcener: -106.467608218662 hartree
chargesum: -0.0000000
charge: -0.263759 -0.411364 -0.255120 0.085727 0.038426 -0.087867 -0.253894 -0.257553 -0.182483 0.366609 -0.053624 -0.202295 -0.237575 0.063613 -0.093614 -0.239525 0.003692 0.161198 -0.052541 0.018099 -0.169638 -0.143148 -0.118686 -0.125860 -0.128379 0.088241 0.070985 0.090470 0.093249 0.071390 0.085341 0.098137 0.084691 0.070050 0.083428 0.083240 0.075910 0.084936 0.084985 0.084935 0.100138 0.113950 0.138044 0.151337 0.098214 0.088315 0.114350 0.108787 0.126009 0.124763 0.125671
qa: -0.2638 -0.4114 -0.2551 0.0857 0.0384 -0.0879 -0.2539 -0.2576 -0.1825 0.3666 -0.0536 -0.2023 -0.2376 0.0636 -0.0936 -0.2395 0.0037 0.1612 -0.0525 0.0181 -0.1696 -0.1431 -0.1187 -0.1259 -0.1284 0.0882 0.0710 0.0905 0.0932 0.0714 0.0853 0.0981 0.0847 0.0700 0.0834 0.0832 0.0759 0.0849 0.0850 0.0849 0.1001 0.1139 0.1380 0.1513 0.0982 0.0883 0.1144 0.1088 0.1260 0.1248 0.1257
va: 2.1383 2.0889 2.3065 3.7388 3.7932 3.8716 3.9173 3.9135 3.9088 4.2154 3.8297 3.9338 3.9444 3.8629 3.6958 4.0134 3.9677 3.7031 3.8572 3.6715 3.9813 3.9802 3.9513 3.9644 3.9546 1.0325 1.0370 1.0042 1.0030 1.0111 1.0025 1.0236 1.0007 1.0221 0.9984 0.9980 1.0124 0.9990 1.0164 0.9989 0.9953 1.0095 1.0082 1.0152 1.0057 1.0090 1.0099 1.0113 1.0000 1.0006 0.9997
dispcorr: -0.021812672 hartree
energy: -1079.755806211456
dipole: 27.52974 -27.59414 -0.06440 12.41678 -11.88849 0.52829 -7.45068 7.82464 0.37396
magnitude: 0.65045 au
magnitude: 1.65331 debye
