program: Orca
programVersion: 5.0.2
elementType: O O O C C C C C C C C C C C C C C C C C C C C C C H H H H H H H H H H H H H H H H H H H H H H H H H H
charge: 0
multiplicity: 1
keywords: wb97x-d3
keywords: def2-TZVPP
keywords: def2/J RIJCOSX
keywords: DEFGRID2
keywords: scfconv7
keywords: smallprint printgap noloewdin
keywords: NOSOSCF
formula: C22H26O3
InChI: InChI=1/C22H26O3/c1-15(2)10-19-20(22(19,3)4)21(23)25-14-17-12-18(24-13-17)11-16-8-6-5-7-9-16/h5-10,12-13,19-20H,11,14H2,1-4H3
51 atoms
O  1.641735 -1.889827 -0.347224
O  0.75106 -0.684505 -2.009578
O  -2.258131 -2.664903 1.44835
C  1.813899 1.61271 -0.090087
C  2.567194 1.55708 -1.37661
C  2.391783 0.290581 -0.570618
C  2.479533 2.204562 1.129036
C  0.323768 1.850928 -0.127007
C  3.909313 2.170378 -1.543704
C  1.505739 -0.780386 -1.074971
C  4.821662 1.772085 -2.431105
C  6.142986 2.466579 -2.561926
C  4.608466 0.616756 -3.360683
C  0.745682 -2.974283 -0.615672
C  -0.597405 -2.731902 -0.022661
C  -1.695189 -2.007974 -0.587953
C  -1.010322 -3.10411 1.212313
C  -2.669364 -1.994976 0.350348
C  -3.993688 -1.324455 0.412946
C  -3.956546 -0.111493 1.313871
C  -3.271535 1.031382 0.911887
C  -4.561647 -0.123246 2.563135
C  -3.195567 2.13921 1.739337
C  -4.48654 0.984578 3.396717
C  -3.802535 2.118317 2.988035
H  1.936017 1.587972 -2.261269
H  3.251747 -0.059462 -0.010664
H  2.363329 3.290413 1.14428
H  3.546214 1.984801 1.172372
H  2.024779 1.81134 2.039519
H  -0.141093 1.458679 -1.028985
H  0.123126 2.923904 -0.090915
H  -0.169714 1.39252 0.732321
H  4.142953 3.023317 -0.91324
H  6.969764 1.77404 -2.384568
H  6.280836 2.8625 -3.571176
H  6.242831 3.294774 -1.861322
H  3.637813 0.14119 -3.236393
H  4.690715 0.939166 -4.401769
H  5.377033 -0.146209 -3.212199
H  1.218683 -3.841065 -0.155471
H  0.675745 -3.156366 -1.689134
H  -1.73153 -1.547964 -1.561052
H  -0.536759 -3.665308 2.001988
H  -4.761853 -2.023207 0.754303
H  -4.269145 -1.030494 -0.601723
H  -2.784704 1.049877 -0.05639
H  -5.094293 -1.007514 2.891864
H  -2.659187 3.019628 1.409502
H  -4.961362 0.958772 4.368816
H  -3.741876 2.981807 3.637275
totalener: -1079.73162777 hartree
nucrepener: 2142.12412858 hartree
electener: -3221.85575635 hartree
oneelecener: -5722.66768942 hartree
twoeener: 2500.81193307 hartree
kineticenergy: 1074.91814933 hartree
xcener: -106.467961461406 hartree
chargesum: -0.0000000
charge: -0.256672 -0.402829 -0.248944 0.158914 -0.037396 -0.094946 -0.284788 -0.291318 -0.230028 0.358170 -0.003475 -0.212402 -0.228196 0.044215 -0.055449 -0.285024 -0.032354 0.236384 -0.134327 0.087620 -0.189480 -0.147157 -0.129178 -0.121442 -0.133040 0.102963 0.080729 0.090909 0.083180 0.094780 0.092966 0.087242 0.103100 0.093326 0.084415 0.086080 0.078063 0.080445 0.088222 0.084060 0.098632 0.112855 0.145683 0.134825 0.095244 0.111030 0.124100 0.105331 0.128022 0.122864 0.124077
qa: -0.2567 -0.4028 -0.2489 0.1589 -0.0374 -0.0949 -0.2848 -0.2913 -0.2300 0.3582 -0.0035 -0.2124 -0.2282 0.0442 -0.0554 -0.2850 -0.0324 0.2364 -0.1343 0.0876 -0.1895 -0.1472 -0.1292 -0.1214 -0.1330 0.1030 0.0807 0.0909 0.0832 0.0948 0.0930 0.0872 0.1031 0.0933 0.0844 0.0861 0.0781 0.0804 0.0882 0.0841 0.0986 0.1129 0.1457 0.1348 0.0952 0.1110 0.1241 0.1053 0.1280 0.1229 0.1241
va: 2.1340 2.0935 2.3120 3.7635 3.8437 3.8254 3.9064 3.8997 3.8965 4.1928 3.7326 3.9413 3.9440 3.9067 3.6953 4.0031 3.9992 3.5910 3.8865 3.6210 3.9806 4.0076 3.9551 3.9589 3.9689 1.0262 1.0339 1.0002 1.0047 1.0063 1.0198 1.0026 0.9945 1.0087 0.9988 0.9984 1.0099 1.0222 1.0014 1.0005 0.9971 1.0049 1.0238 1.0070 1.0139 1.0065 1.0010 1.0121 0.9986 1.0005 0.9998
dispcorr: -0.025031979 hartree
energy: -1079.756659749592
dipole: 20.23903 -19.90357 0.33545 16.65615 -16.67685 -0.02070 -6.35637 6.70250 0.34614
magnitude: 0.48246 au
magnitude: 1.22631 debye
