program: Orca
programVersion: 5.0.2
elementType: O O O C C C C C C C C C C C C C C C C C C C C C C H H H H H H H H H H H H H H H H H H H H H H H H H H
charge: 0
multiplicity: 1
keywords: wb97x-d3
keywords: def2-TZVPP
keywords: def2/J RIJCOSX
keywords: DEFGRID2
keywords: scfconv7
keywords: smallprint printgap noloewdin
keywords: NOSOSCF
formula: C22H26O3
InChI: InChI=1/C22H26O3/c1-15(2)10-19-20(22(19,3)4)21(23)25-14-17-12-18(24-13-17)11-16-8-6-5-7-9-16/h5-10,12-13,19-20H,11,14H2,1-4H3
51 atoms
O  1.224528 -1.095905 0.242672
O  2.995474 -0.985664 1.60272
O  -2.458672 -3.404481 -0.313804
C  4.380043 -0.025736 -1.063843
C  4.147837 1.135649 -0.15583
C  2.997951 0.208124 -0.474241
C  4.493282 0.223926 -2.549026
C  5.23623 -1.172185 -0.584735
C  4.157016 2.532796 -0.662141
C  2.445728 -0.672541 0.577867
C  3.286798 3.488641 -0.33398
C  3.400694 4.873121 -0.897408
C  2.141802 3.277682 0.608439
C  0.57179 -1.982529 1.15411
C  -0.766731 -2.296689 0.597201
C  -1.888821 -1.416619 0.474436
C  -1.180837 -3.483592 0.099743
C  -2.884199 -2.14227 -0.085457
C  -4.281302 -1.814656 -0.483699
C  -4.680982 -0.448555 0.001751
C  -5.24442 -0.286051 1.262789
C  -4.458836 0.678176 -0.78144
C  -5.583709 0.973949 1.730475
C  -4.793764 1.941465 -0.316304
C  -5.35768 2.092462 0.941618
H  4.546237 1.003692 0.847966
H  2.260985 0.57628 -1.178945
H  4.212855 -0.669113 -3.109593
H  5.520229 0.475437 -2.822174
H  3.852919 1.040035 -2.882927
H  5.2009 -1.303785 0.493493
H  6.276165 -0.993915 -0.86418
H  4.929163 -2.111119 -1.048967
H  4.966911 2.789733 -1.339787
H  3.54563 5.609815 -0.103482
H  4.231334 4.965394 -1.595975
H  2.485972 5.159385 -1.422794
H  2.166494 4.019135 1.410614
H  1.185184 3.40865 0.095717
H  2.145015 2.293305 1.069678
H  0.48766 -1.5101 2.135991
H  1.16272 -2.892692 1.284261
H  -1.940975 -0.380622 0.766845
H  -0.690479 -4.437199 -0.013028
H  -4.963361 -2.569497 -0.081044
H  -4.380468 -1.870502 -1.572712
H  -5.417086 -1.155525 1.885851
H  -4.017485 0.566419 -1.764724
H  -6.025159 1.082429 2.712486
H  -4.616087 2.808541 -0.938914
H  -5.62261 3.076716 1.304605
totalener: -1079.73243867 hartree
nucrepener: 2056.23382216 hartree
electener: -3135.96626084 hartree
oneelecener: -5550.60185724 hartree
twoeener: 2414.63559641 hartree
kineticenergy: 1074.90907628 hartree
xcener: -106.465246646934 hartree
chargesum: -0.0000000
charge: -0.248645 -0.387998 -0.256265 0.117627 -0.004791 -0.112553 -0.268962 -0.261276 -0.240442 0.321822 -0.006917 -0.211893 -0.225604 0.058336 -0.048620 -0.221437 -0.028654 0.160446 -0.053530 0.015902 -0.153475 -0.159338 -0.120679 -0.121142 -0.128486 0.104214 0.090689 0.091801 0.087865 0.085070 0.101233 0.082837 0.085549 0.092215 0.087581 0.078611 0.083217 0.089788 0.088050 0.086217 0.101274 0.090540 0.137662 0.136085 0.094328 0.092593 0.110386 0.111778 0.125713 0.125281 0.125999
qa: -0.2486 -0.3880 -0.2563 0.1176 -0.0048 -0.1126 -0.2690 -0.2613 -0.2404 0.3218 -0.0069 -0.2119 -0.2256 0.0583 -0.0486 -0.2214 -0.0287 0.1604 -0.0535 0.0159 -0.1535 -0.1593 -0.1207 -0.1211 -0.1285 0.1042 0.0907 0.0918 0.0879 0.0851 0.1012 0.0828 0.0855 0.0922 0.0876 0.0786 0.0832 0.0898 0.0880 0.0862 0.1013 0.0905 0.1377 0.1361 0.0943 0.0926 0.1104 0.1118 0.1257 0.1253 0.1260
va: 2.1198 2.1154 2.3012 3.7461 3.7982 3.8544 3.9091 3.9056 3.8986 4.2005 3.7424 3.9415 3.9394 3.8811 3.7644 3.9890 3.9761 3.7059 3.8638 3.6761 3.9894 3.9764 3.9593 3.9558 3.9547 1.0268 1.0279 1.0060 1.0024 1.0058 1.0209 1.0026 1.0013 1.0102 0.9985 1.0098 0.9993 1.0023 1.0008 1.0144 0.9950 1.0050 1.0102 1.0087 1.0095 1.0052 1.0108 1.0111 1.0002 1.0002 0.9997
dispcorr: -0.022160745 hartree
energy: -1079.754599416347
dipole: 19.94905 -20.48456 -0.53550 17.75238 -17.35506 0.39732 -6.75731 6.24111 -0.51620
magnitude: 0.84326 au
magnitude: 2.14340 debye
