program: Orca
programVersion: 5.0.2
elementType: O O O C C C C C C C C C C C C C C C C C C C H H H H H H H H H H H H H H H H H H H H H H H H
charge: 0
multiplicity: 1
keywords: wb97x-d3
keywords: def2-TZVPP
keywords: def2/J RIJCOSX
keywords: DEFGRID2
keywords: scfconv7
keywords: smallprint printgap noloewdin
keywords: NOSOSCF
formula: C19H24O3
InChI: InChI=1/C19H24O3/c1-7-8-13-12(4)16(10-15(13)20)22-18(21)17-14(9-11(2)3)19(17,5)6/h1,9,14,16-17H,8,10H2,2-6H3
46 atoms
O  -0.580029 -0.041025 1.302846
O  -1.798801 -1.304621 2.676311
O  2.969168 -2.151732 0.089893
C  -2.997361 0.619283 -0.305463
C  -2.572482 -0.720611 -0.809065
C  -2.802015 -0.51253 0.689483
C  -2.091059 1.827326 -0.355187
C  -4.448664 0.984566 -0.523894
C  -1.224074 -1.055787 -1.337792
C  -1.701383 -0.656387 1.655537
C  -0.659576 -0.54916 -2.436213
C  0.619275 -0.302009 2.04356
C  0.689589 -1.015569 -2.893762
C  -1.289523 0.497551 -3.301188
C  1.21313 -1.662118 1.698042
C  1.61275 0.698661 1.507235
C  2.542511 0.107467 0.744528
C  2.332129 -1.344198 0.73581
C  1.459291 2.140027 1.804372
C  3.641008 0.772743 -0.02938
C  3.120337 1.592144 -1.117317
C  2.66785 2.257214 -2.010885
H  -3.372744 -1.307981 -1.254358
H  -3.716297 -0.945464 1.077726
H  -2.389452 2.457876 -1.194242
H  -2.195173 2.428619 0.549781
H  -1.040042 1.590171 -0.490294
H  -4.584342 1.427084 -1.51284
H  -5.104122 0.115698 -0.455395
H  -4.783557 1.714356 0.215597
H  -0.684875 -1.839436 -0.81197
H  0.441062 -0.163953 3.111622
H  0.50254 -2.370709 1.27226
H  1.642299 -2.131046 2.58651
H  1.118369 -1.7611 -2.224234
H  0.635287 -1.449868 -3.89518
H  1.389114 -0.177961 -2.957404
H  -1.317987 0.161417 -4.340761
H  -2.306176 0.748355 -3.004626
H  -0.696409 1.415786 -3.292798
H  0.511823 2.518488 1.414153
H  2.263057 2.742789 1.387108
H  1.43546 2.295658 2.885253
H  4.244857 1.397288 0.634128
H  4.316637 0.017346 -0.437096
H  2.271735 2.862463 -2.795296
elementType: O C H
totalener: -964.15563531 hartree
nucrepener: 1906.54342580 hartree
electener: -2870.69906110 hartree
oneelecener: -5098.07372460 hartree
twoeener: 2227.37466350 hartree
cpcmener: -0.04033248 hartree
kineticenergy: 959.77881662 hartree
xcener: -94.701174259873 hartree
chargesum: -0.0000000
charge: -0.265452 -0.500953 -0.480172 0.083725 0.010372 -0.096637 -0.275830 -0.273959 -0.292583 0.395658 -0.014673 0.245999 -0.248716 -0.255753 -0.161087 -0.018283 -0.098174 0.311761 -0.240176 -0.081286 -0.450514 0.010019 0.110810 0.091842 0.099818 0.117666 0.073349 0.092687 0.088611 0.099076 0.132829 0.111826 0.103898 0.118287 0.088952 0.112254 0.088242 0.107771 0.092353 0.098387 0.112207 0.098258 0.120447 0.137608 0.111128 0.288406
qa: -0.2655 -0.5010 -0.4802 0.0837 0.0104 -0.0966 -0.2758 -0.2740 -0.2926 0.3957 -0.0147 0.2460 -0.2487 -0.2558 -0.1611 -0.0183 -0.0982 0.3118 -0.2402 -0.0813 -0.4505 0.0100 0.1108 0.0918 0.0998 0.1177 0.0733 0.0927 0.0886 0.0991 0.1328 0.1118 0.1039 0.1183 0.0890 0.1123 0.0882 0.1078 0.0924 0.0984 0.1122 0.0983 0.1204 0.1376 0.1111 0.2884
va: 2.1129 1.9960 2.0003 3.6932 3.7721 3.8718 3.8744 3.9128 3.8611 4.1381 3.6412 3.7434 3.9171 3.9356 3.9226 3.7543 3.5348 3.9730 3.9438 3.8610 3.8001 3.5684 1.0064 1.0258 1.0008 1.0003 1.0045 1.0033 1.0057 1.0004 1.0001 1.0176 1.0271 1.0151 1.0138 1.0008 1.0001 1.0011 1.0037 0.9965 0.9980 1.0022 0.9998 0.9885 1.0198 0.9476
dispcorr: -0.028162372 hartree
energy: -964.183797677870
dipole: -10.64991 10.10893 -0.54099 10.96279 -8.65035 2.31244 -12.67420 12.63894 -0.03526
magnitude: 2.37514 au
magnitude: 6.03712 debye
