program: Orca
programVersion: 5.0.2
elementType: O O O C C C C C C C C C C C C C C C C C C C H H H H H H H H H H H H H H H H H H H H H H H H
charge: 0
multiplicity: 1
keywords: wb97x-d3
keywords: def2-TZVPP
keywords: def2/J RIJCOSX
keywords: DEFGRID2
keywords: scfconv7
keywords: smallprint printgap noloewdin
keywords: NOSOSCF
formula: C19H24O3
InChI: InChI=1/C19H24O3/c1-7-8-13-12(4)16(10-15(13)20)22-18(21)17-14(9-11(2)3)19(17,5)6/h1,9,14,16-17H,8,10H2,2-6H3
46 atoms
O  -0.641212 -0.005912 1.074997
O  -1.80109 -1.554964 2.177306
O  3.216989 -2.150161 0.110862
C  -3.268724 0.963614 -0.126331
C  -2.679198 -0.0369 -1.057939
C  -2.871431 -0.396503 0.422713
C  -2.526165 2.224372 0.240876
C  -4.762856 1.178517 -0.207027
C  -1.342748 0.139215 -1.680371
C  -1.743322 -0.703178 1.313811
C  -0.584172 -0.851997 -2.154464
C  0.56368 -0.382957 1.74972
C  0.734811 -0.578941 -2.809876
C  -0.973795 -2.295579 -2.068959
C  1.129045 -1.717539 1.271878
C  1.588485 0.643642 1.345757
C  2.626891 0.087649 0.706214
C  2.441473 -1.36231 0.614869
C  1.3823 2.08087 1.639677
C  3.818425 0.794399 0.133886
C  3.445547 1.693245 -0.951751
C  3.108055 2.434776 -1.835856
H  -3.39752 -0.559697 -1.683871
H  -3.706523 -1.056938 0.624308
H  -2.812844 3.021833 -0.447198
H  -2.798062 2.55008 1.246434
H  -1.444254 2.139083 0.201102
H  -5.159562 1.533743 0.745741
H  -4.999125 1.926962 -0.965563
H  -5.292276 0.261714 -0.468485
H  -0.975074 1.156395 -1.779042
H  0.404267 -0.360279 2.830884
H  0.483966 -2.226079 0.552549
H  1.301159 -2.41121 2.095894
H  0.954293 0.487262 -2.865047
H  1.548981 -1.065014 -2.265277
H  0.76133 -0.98331 -3.825109
H  -1.798834 -2.475751 -1.381279
H  -1.270609 -2.676341 -3.050398
H  -0.127295 -2.906362 -1.746558
H  0.892426 2.216113 2.604443
H  0.73627 2.536151 0.884657
H  2.31965 2.635088 1.6433
H  4.32655 1.368831 0.913466
H  4.543799 0.064015 -0.230951
H  2.825437 3.097163 -2.623018
elementType: O C H
totalener: -964.15756194 hartree
nucrepener: 1901.71091337 hartree
electener: -2865.86847531 hartree
oneelecener: -5088.22459918 hartree
twoeener: 2222.35612387 hartree
cpcmener: -0.04025697 hartree
kineticenergy: 959.78142817 hartree
xcener: -94.702017543994 hartree
chargesum: -0.0000000
charge: -0.263976 -0.503487 -0.483824 0.142881 -0.014568 -0.140658 -0.272249 -0.271359 -0.244697 0.415495 -0.032598 0.222815 -0.238938 -0.287797 -0.137388 -0.013167 -0.093354 0.297076 -0.298635 -0.067624 -0.453664 0.007719 0.115460 0.093780 0.101094 0.104810 0.062376 0.096264 0.094755 0.088514 0.125413 0.115744 0.112753 0.120162 0.084849 0.088248 0.112000 0.099144 0.117959 0.093170 0.122295 0.127091 0.116814 0.137359 0.109826 0.292115
qa: -0.2640 -0.5035 -0.4838 0.1429 -0.0146 -0.1407 -0.2722 -0.2714 -0.2447 0.4155 -0.0326 0.2228 -0.2389 -0.2878 -0.1374 -0.0132 -0.0934 0.2971 -0.2986 -0.0676 -0.4537 0.0077 0.1155 0.0938 0.1011 0.1048 0.0624 0.0963 0.0948 0.0885 0.1254 0.1157 0.1128 0.1202 0.0848 0.0882 0.1120 0.0991 0.1180 0.0932 0.1223 0.1271 0.1168 0.1374 0.1098 0.2921
va: 2.1094 1.9949 2.0015 3.7455 3.7822 3.8825 3.9048 3.9042 3.8126 4.1058 3.6789 3.7821 3.9209 3.9432 3.8874 3.7274 3.5201 3.9825 3.9470 3.8576 3.8132 3.5723 1.0027 1.0276 1.0007 1.0011 1.0099 1.0017 1.0018 1.0050 0.9986 1.0128 1.0171 1.0178 1.0076 1.0004 0.9997 1.0024 0.9982 0.9982 1.0022 0.9850 0.9975 0.9892 1.0232 0.9448
dispcorr: -0.027944452 hartree
energy: -964.185506390391
dipole: -11.93671 11.04034 -0.89637 8.00879 -5.77831 2.23049 -8.62915 8.70394 0.07478
magnitude: 2.40502 au
magnitude: 6.11308 debye
