program: Orca
programVersion: 5.0.2
elementType: O O O C C C C C C C C C C C C C C C C C C C H H H H H H H H H H H H H H H H H H H H H H H H
charge: 0
multiplicity: 1
keywords: wb97x-d3
keywords: def2-TZVPP
keywords: def2/J RIJCOSX
keywords: DEFGRID2
keywords: scfconv7
keywords: smallprint printgap noloewdin
keywords: NOSOSCF
formula: C19H24O3
InChI: InChI=1/C19H24O3/c1-7-8-13-12(4)16(10-15(13)20)22-18(21)17-14(9-11(2)3)19(17,5)6/h1,9,14,16-17H,8,10H2,2-6H3
46 atoms
O  -0.486447 -0.264851 0.781533
O  -1.473947 -0.724396 2.723078
O  3.809415 -1.690638 1.858068
C  -3.437027 0.222441 -0.082817
C  -2.9074 -1.011505 -0.741783
C  -2.775559 -0.860587 0.761183
C  -2.763012 1.558628 -0.272083
C  -4.932945 0.338887 0.08452
C  -1.748063 -1.053019 -1.671986
C  -1.534071 -0.615842 1.519562
C  -1.708541 -0.486367 -2.880519
C  0.726897 0.072492 1.455175
C  -0.508081 -0.641441 -3.765499
C  -2.821359 0.329167 -3.462951
C  1.461331 -1.111178 2.075166
C  1.674356 0.621235 0.420077
C  2.880199 0.041309 0.499853
C  2.864127 -1.010506 1.522234
C  1.250845 1.699274 -0.504072
C  4.108185 0.372587 -0.295729
C  4.659575 1.675733 0.055779
C  5.096638 2.756007 0.349519
H  -3.678455 -1.73835 -0.991403
H  -3.468617 -1.449545 1.351276
H  -3.283889 2.125766 -1.04548
H  -2.810883 2.149312 0.645458
H  -1.721539 1.48822 -0.573315
H  -5.404081 -0.632289 0.241568
H  -5.184818 0.972912 0.937223
H  -5.384292 0.786795 -0.803932
H  -0.897735 -1.654046 -1.367075
H  0.520317 0.848496 2.199439
H  1.02712 -2.064224 1.762196
H  1.46781 -1.096622 3.164681
H  0.285364 -1.217139 -3.28839
H  -0.770373 -1.141616 -4.701915
H  -0.096677 0.332732 -4.043709
H  -3.126003 -0.080627 -4.429976
H  -3.705163 0.369563 -2.828995
H  -2.495552 1.3548 -3.655845
H  2.089946 2.142043 -1.037154
H  0.72932 2.492476 0.034943
H  0.55172 1.308954 -1.248322
H  4.868341 -0.394852 -0.132363
H  3.883088 0.354966 -1.365332
H  5.486346 3.713687 0.612561
elementType: O C H
totalener: -964.16694228 hartree
nucrepener: 1830.71950176 hartree
electener: -2794.88644404 hartree
oneelecener: -4945.59784500 hartree
twoeener: 2150.71140096 hartree
cpcmener: -0.03298042 hartree
kineticenergy: 959.76723370 hartree
xcener: -94.696772632454 hartree
chargesum: -0.0000000
charge: -0.276907 -0.467985 -0.445357 0.070616 0.021847 -0.086714 -0.285148 -0.273247 -0.274027 0.391291 -0.019084 0.218200 -0.242159 -0.262698 -0.137202 0.003147 -0.096074 0.295972 -0.287253 -0.107825 -0.461094 0.050140 0.114731 0.094579 0.098152 0.117840 0.084066 0.087306 0.098816 0.090375 0.106804 0.112130 0.105839 0.102322 0.090494 0.105981 0.092719 0.106233 0.091469 0.099801 0.108260 0.119719 0.111198 0.111123 0.134622 0.286984
qa: -0.2769 -0.4680 -0.4454 0.0706 0.0218 -0.0867 -0.2851 -0.2732 -0.2740 0.3913 -0.0191 0.2182 -0.2422 -0.2627 -0.1372 0.0031 -0.0961 0.2960 -0.2873 -0.1078 -0.4611 0.0501 0.1147 0.0946 0.0982 0.1178 0.0841 0.0873 0.0988 0.0904 0.1068 0.1121 0.1058 0.1023 0.0905 0.1060 0.0927 0.1062 0.0915 0.0998 0.1083 0.1197 0.1112 0.1111 0.1346 0.2870
va: 2.1188 2.0419 2.0638 3.7315 3.7419 3.8828 3.8925 3.9136 3.8585 4.1304 3.6847 3.7659 3.9217 3.9369 3.8965 3.6859 3.5207 4.0658 3.9624 3.8752 3.8257 3.5275 1.0048 1.0273 1.0015 1.0016 1.0019 1.0062 1.0007 1.0030 1.0241 1.0145 1.0209 1.0261 1.0062 0.9980 0.9955 1.0011 1.0061 0.9958 1.0064 0.9977 0.9913 1.0202 0.9885 0.9469
dispcorr: -0.025293805 hartree
energy: -964.192236084990
dipole: -20.03533 18.22634 -1.80898 8.30449 -6.82180 1.48268 -19.64899 17.37314 -2.27585
magnitude: 3.26347 au
magnitude: 8.29509 debye
