program: Gaussian 09
title: 000069507
version: EM64L-G09RevD.01
frameworkgroup: C1[X(C6H13O9P)]
method: RPBEPBE
basis: SDD
operation: Freq
keyword: #p
keyword: freq=noraman
keyword: PBEPBE/SDD
title: #p freq=noraman PBEPBE/SDD
converged: YES YES NO NO
title: Mulliken charges:
elementType: P O O O O O O O O O C C C C C C H H H H H H H H H H H H H
charge: 1.396507 -0.446240 -0.470191 -0.553298 -0.444533 -0.231014 -0.445154 -0.685761 -0.668621 -0.575083 -0.152256 -0.058185 -0.167949 -0.328414 0.129414 -0.353622 0.232507 0.275624 0.286963 0.250781 0.250307 0.353955 0.379186 0.235111 0.236492 0.374220 0.369783 0.408933 0.400540
chargesum: 0.00000
title: Mulliken charges with hydrogens summed into heavy atoms:
elementType: P O O O O O O O O O C C C C C C
charge: 1.396507 -0.092285 -0.091005 -0.553298 -0.070313 -0.231014 -0.075371 -0.276828 -0.268081 -0.575083 0.080251 0.217439 0.119014 0.172674 0.129414 0.117981
polarizability: 1.57115628e+02 -5.73833800e+00 1.02814062e+02 7.16369420e+00 3.46565061e+00 1.03668354e+02
1716.lowfreq: -2.7869 0.0011 0.0016 0.0019 4.9013 8.4427 18.8598 21.1236 34.0804
frequency: 18.2924 21.1156 33.9943 44.8632 55.3537 72.0994 91.2803 114.7991 127.5454 143.0686 166.7065 187.1167 205.7228 230.2007 241.4960 248.9460 258.5017 296.0574 310.2415 340.8032 351.4768 359.0575 373.9265 389.9314 397.1000 401.6658 413.1581 453.8495 464.3497 482.1242 546.7165 648.2384 669.6842 720.8335 728.1936 746.4709 824.8718 865.3743 904.0911 947.3795 951.7142 972.1021 1005.4962 1011.3099 1016.6746 1038.3139 1050.5653 1069.8003 1091.3808 1103.8939 1126.8636 1177.4871 1186.2213 1201.4855 1216.4850 1238.5019 1260.3702 1286.4079 1298.0751 1326.0062 1354.8588 1369.6081 1384.6303 1386.2975 1392.7275 1442.4497 1464.7509 1610.3154 2957.2396 2979.1330 2992.9022 3005.8460 3020.2765 3028.8565 3087.3741 3442.1731 3488.2012 3559.8052 3586.9122 3592.8064 3615.2986
redmass: 5.6617 6.5729 5.6781 5.6317 5.4487 4.3762 6.8113 4.1817 4.7977 6.5201 2.3923 3.2514 4.1284 3.9919 2.1229 3.0609 1.7821 2.4002 2.4949 5.3041 3.8439 1.7600 1.7193 1.7597 3.3935 3.6126 1.3382 2.4802 4.3299 2.8440 3.7013 9.9230 4.2138 4.0112 9.3607 6.5740 4.0435 2.7720 3.4033 8.0543 2.7396 3.9421 1.3426 2.4835 1.4007 3.4436 3.1729 2.4753 5.8571 3.0889 1.9914 1.0917 1.1485 1.1579 1.1382 1.4410 1.5698 1.3031 1.3760 1.2186 1.3168 1.2687 1.3261 1.4380 1.4459 1.0722 1.0848 8.3613 1.0577 1.0834 1.1003 1.0564 1.0843 1.0841 1.1095 1.0646 1.0647 1.0657 1.0670 1.0662 1.0666
irintensity: 1.3759 1.0955 0.4936 3.9351 2.5262 0.8942 5.3204 9.3392 12.5248 10.8784 60.3238 37.9488 32.4252 17.5300 49.7697 20.8152 127.4100 39.3412 131.6343 33.3695 57.7038 78.3168 61.1131 15.1348 142.6106 12.0853 180.7206 16.6149 10.0224 56.0133 10.5182 41.7032 7.1966 11.8240 239.6511 203.0979 26.3175 17.3112 21.1153 194.9398 45.5305 87.9338 31.1307 132.6175 70.2397 129.1232 28.9545 13.4541 191.5723 30.2557 4.0572 40.1964 31.8219 17.0718 13.6949 21.1737 158.7118 22.3918 27.3415 9.1930 1.0470 1.3593 100.4437 18.8600 17.5048 10.2109 11.6156 76.8589 48.1708 22.5196 19.9341 16.4899 16.0354 14.7151 14.7591 21.4690 37.1665 21.2862 13.3451 74.9736 77.1637
temp: 298.150 k
press: 1.00000 atm
elementType: 15 8 8 8 8 8 8 8 8 8 6 6 6 6 6 6 1 1 1 1 1 1 1 1 1 1 1 1 1
symmnumber: 1
zpe: 546025.4 jmol-1
zpe.correction: 0.207970 hartree
zpe.thermalcorrener: 0.228212 hartree
zpe.thermalcorrenthalpy: 0.229157 hartree
zpe.thermalcorrgfe: 0.156524 hartree
zpe.sumelectzpe: -1253.322527 hartree
zpe.sumelectthermal: -1253.302285 hartree
zpe.sumelectthermalent: -1253.301340 hartree
zpe.sumelectthermalfe: -1253.373973 hartree
dipole: 3.3260 2.0503 -2.5151
dipole: 4.6466
quadrupole: -121.3006 -100.7679 -103.4451
quadrupole: 5.9737 -17.6399 -0.3389
quadrupole: -12.7960 7.7366 5.0594 5.9737 -17.6399 -0.3389
hfenergy: -1253.530497 hartree
pointgroup: C01 [X(C6H13O9P1)]
dipole: -1.3273764 -1.0560721 -0.681791 debye
polarizability: 156.818505|-7.9500342|101.0146686|-6.1302283|-2.4407949|105.7648702 unknown
InChI: InChI=1S/C6H13O9P/c7-1-3(8)5(10)6(11)4(9)2-15-16(12,13)14/h4-7,9-13H,1-2H2
charge 0 multiplicity 1
29 atoms
P  -4.342176 -0.206506 0.095475
O  1.034696 -0.930205 -1.286467
O  -0.35817 0.554544 1.810788
O  -2.745932 0.261643 0.472422
O  1.895385 1.795764 -0.778417
O  4.110984 0.318098 -1.204455
O  5.292209 -1.555028 0.332483
O  -4.188453 -1.899452 0.308295
O  -4.469157 -0.170261 -1.632067
O  -5.447708 0.603657 0.87918
C  0.970254 -0.347319 0.061663
C  -0.374588 0.350411 0.35678
C  2.121909 0.693164 0.136148
C  -1.574671 -0.503462 -0.055821
C  3.461946 0.013164 -0.165231
C  4.021839 -1.036708 0.788321
H  1.116276 -1.116343 0.849953
H  -0.415177 1.319364 -0.178309
H  2.116378 1.111778 1.160319
H  -1.65326 -0.593048 -1.153851
H  -1.572602 -1.498071 0.426345
H  0.586755 -1.811755 -1.301022
H  -1.226796 0.957495 2.069331
H  4.138178 -0.577503 1.792748
H  3.29301 -1.868208 0.888195
H  2.399043 1.596723 -1.614441
H  5.505066 -1.10067 -0.53103
H  -4.969941 -2.445202 0.042733
H  -4.879595 0.656738 -1.993668
