program: Orca
programVersion: 5.0.2
elementType: O O O C C C C C C C C C C C C C C C C C C C H H H H H H H H H H H H H H H H H H H H H H H H
charge: 0
multiplicity: 1
keywords: wb97x-d3
keywords: def2-TZVPP
keywords: def2/J RIJCOSX
keywords: DEFGRID2
keywords: scfconv7
keywords: smallprint printgap noloewdin
keywords: NOSOSCF
formula: C19H24O3
InChI: InChI=1/C19H24O3/c1-7-8-13-12(4)16(10-15(13)20)22-18(21)17-14(9-11(2)3)19(17,5)6/h1,9,14,16-17H,8,10H2,2-6H3
46 atoms
O  0.151195 -0.621717 0.859227
O  -1.254953 1.118934 0.813647
O  4.106598 -1.095591 3.198445
C  -3.350436 -1.030404 -0.051038
C  -2.801342 -0.529336 -1.349808
C  -1.844554 -0.961369 -0.238191
C  -4.067755 -0.093177 0.887494
C  -3.922984 -2.42798 -0.039932
C  -2.931798 0.867751 -1.810887
C  -0.995476 -0.022199 0.515036
C  -3.404816 1.232129 -3.008046
C  1.105294 0.078122 1.65945
C  -3.467393 2.677089 -3.401819
C  -3.885249 0.274131 -4.060328
C  1.74974 -0.870072 2.661461
C  2.245674 0.582225 0.810308
C  3.431597 0.20072 1.306754
C  3.233179 -0.64725 2.48781
C  1.995249 1.415006 -0.389058
C  4.794811 0.541594 0.782917
C  5.129361 -0.226389 -0.410454
C  5.37931 -0.858121 -1.402042
H  -2.81992 -1.262648 -2.148876
H  -1.366357 -1.918167 -0.411611
H  -3.944983 -0.413567 1.924026
H  -3.743958 0.941307 0.818301
H  -5.136712 -0.112961 0.665468
H  -3.868996 -2.86626 0.95887
H  -4.972836 -2.414683 -0.340166
H  -3.392163 -3.092211 -0.723337
H  -2.619291 1.654099 -1.134798
H  0.625107 0.920473 2.162832
H  1.5195 -1.911754 2.42396
H  1.438554 -0.691964 3.690983
H  -3.054298 3.334461 -2.636718
H  -2.916141 2.853605 -4.329881
H  -4.497729 2.988532 -3.594208
H  -4.216583 -0.682717 -3.659942
H  -4.723237 0.701754 -4.614033
H  -3.101213 0.070244 -4.795532
H  1.521911 0.820894 -1.174896
H  2.911949 1.833828 -0.800287
H  1.312955 2.23536 -0.159281
H  4.860602 1.608887 0.555759
H  5.54312 0.34679 1.555149
H  5.613564 -1.41504 -2.281262
elementType: O C H
totalener: -964.17048168 hartree
nucrepener: 1753.49734979 hartree
electener: -2717.66783147 hartree
oneelecener: -4791.83878857 hartree
twoeener: 2074.17095711 hartree
cpcmener: -0.03082513 hartree
kineticenergy: 959.75439805 hartree
xcener: -94.693453760521 hartree
chargesum: -0.0000000
charge: -0.295792 -0.471131 -0.444928 0.123270 0.040763 -0.128781 -0.287083 -0.264190 -0.327046 0.404425 -0.008445 0.248767 -0.223757 -0.280172 -0.132463 -0.028189 -0.092731 0.287133 -0.245980 -0.106444 -0.450934 0.041644 0.113225 0.095207 0.102849 0.097048 0.096676 0.093777 0.093941 0.087358 0.125045 0.102228 0.101127 0.099088 0.087360 0.094238 0.092824 0.094306 0.094266 0.105428 0.115413 0.102990 0.116379 0.131687 0.112417 0.287188
qa: -0.2958 -0.4711 -0.4449 0.1233 0.0408 -0.1288 -0.2871 -0.2642 -0.3270 0.4044 -0.0084 0.2488 -0.2238 -0.2802 -0.1325 -0.0282 -0.0927 0.2871 -0.2460 -0.1064 -0.4509 0.0416 0.1132 0.0952 0.1028 0.0970 0.0967 0.0938 0.0939 0.0874 0.1250 0.1022 0.1011 0.0991 0.0874 0.0942 0.0928 0.0943 0.0943 0.1054 0.1154 0.1030 0.1164 0.1317 0.1124 0.2872
va: 2.1293 2.0229 2.0620 3.6977 3.7357 3.9389 3.9114 3.9108 3.8912 4.0912 3.7215 3.7737 3.9303 3.9465 3.8997 3.7399 3.5154 4.0625 3.9360 3.8857 3.8332 3.5398 1.0022 1.0304 0.9992 1.0132 1.0016 1.0023 1.0019 1.0051 1.0231 1.0323 1.0286 1.0246 1.0093 0.9942 0.9960 1.0033 0.9995 0.9937 0.9995 1.0030 1.0082 0.9892 1.0187 0.9470
dispcorr: -0.021181611 hartree
energy: -964.191663287410
dipole: -27.14870 25.55411 -1.59459 3.57052 -3.41381 0.15671 -16.79263 15.31581 -1.47682
magnitude: 2.17905 au
magnitude: 5.53872 debye
