program: Orca
programVersion: 5.0.2
elementType: O O O C C C C C C C C C C C C C C C C C C C H H H H H H H H H H H H H H H H H H H H H H H H
charge: 0
multiplicity: 1
keywords: wb97x-d3
keywords: def2-TZVPP
keywords: def2/J RIJCOSX
keywords: DEFGRID2
keywords: scfconv7
keywords: smallprint printgap noloewdin
keywords: NOSOSCF
formula: C19H24O3
InChI: InChI=1/C19H24O3/c1-7-8-13-12(4)16(10-15(13)20)22-18(21)17-14(9-11(2)3)19(17,5)6/h1,9,14,16-17H,8,10H2,2-6H3
46 atoms
O  0.04806 -0.652545 0.985249
O  -1.282557 1.143524 0.890304
O  4.1371 -1.276065 2.962437
C  -3.485756 -0.879931 0.021913
C  -2.828452 -0.518003 -1.273135
C  -1.973634 -0.947804 -0.075467
C  -4.180371 0.168573 0.854891
C  -4.170247 -2.225069 0.089616
C  -2.811097 0.852748 -1.81584
C  -1.077904 -0.019341 0.635041
C  -3.010234 1.193618 -3.094962
C  1.046325 0.042208 1.73631
C  -2.982608 2.635531 -3.507197
C  -3.274249 0.240528 -4.220675
C  1.751521 -0.928808 2.674183
C  2.131374 0.571046 0.828558
C  3.343155 0.149814 1.218965
C  3.219192 -0.756505 2.365598
C  1.810925 1.465714 -0.308381
C  4.673552 0.491388 0.618875
C  4.988099 -0.35221 -0.5275
C  5.230315 -1.053888 -1.472342
H  -2.868302 -1.300376 -2.022574
H  -1.567934 -1.949151 -0.159328
H  -4.147166 -0.096025 1.913641
H  -3.771367 1.168992 0.75162
H  -5.231857 0.216182 0.564533
H  -4.203129 -2.59534 1.116559
H  -5.198905 -2.151179 -0.269451
H  -3.660913 -2.974705 -0.517643
H  -2.635584 1.659682 -1.114855
H  0.590885 0.869052 2.286271
H  1.458238 -1.962526 2.476872
H  1.550604 -0.729425 3.727335
H  -3.936771 2.936889 -3.948111
H  -2.775439 3.300786 -2.668998
H  -2.221893 2.812125 -4.272597
H  -2.498731 0.327204 -4.986479
H  -3.324766 -0.804061 -3.92033
H  -4.218709 0.48582 -4.713661
H  2.70413 1.81762 -0.821084
H  1.243176 2.33417 0.030813
H  1.189724 0.950245 -1.044733
H  4.696029 1.539004 0.310124
H  5.455861 0.378576 1.373698
H  5.444252 -1.666587 -2.31928
elementType: O C H
totalener: -964.17134153 hartree
nucrepener: 1760.55104512 hartree
electener: -2724.72238665 hartree
oneelecener: -4805.99837084 hartree
twoeener: 2081.27598419 hartree
cpcmener: -0.03159955 hartree
kineticenergy: 959.75983133 hartree
xcener: -94.694707284287 hartree
chargesum: 0.0000000
charge: -0.294513 -0.469103 -0.444478 0.105371 0.036591 -0.100627 -0.284651 -0.262064 -0.300679 0.394104 -0.051933 0.245747 -0.217071 -0.254259 -0.132166 -0.030641 -0.090850 0.288384 -0.244311 -0.114548 -0.446255 0.042862 0.116276 0.094965 0.101572 0.096826 0.096153 0.093729 0.094426 0.086877 0.121996 0.103936 0.101059 0.099897 0.092764 0.087860 0.091624 0.096736 0.087869 0.095365 0.102068 0.118293 0.112246 0.130726 0.115185 0.286642
qa: -0.2945 -0.4691 -0.4445 0.1054 0.0366 -0.1006 -0.2847 -0.2621 -0.3007 0.3941 -0.0519 0.2457 -0.2171 -0.2543 -0.1322 -0.0306 -0.0908 0.2884 -0.2443 -0.1145 -0.4463 0.0429 0.1163 0.0950 0.1016 0.0968 0.0962 0.0937 0.0944 0.0869 0.1220 0.1039 0.1011 0.0999 0.0928 0.0879 0.0916 0.0967 0.0879 0.0954 0.1021 0.1183 0.1122 0.1307 0.1152 0.2866
va: 2.1293 2.0249 2.0623 3.7117 3.7358 3.8854 3.9063 3.9081 3.8517 4.0996 3.7850 3.7751 3.9220 3.9388 3.8977 3.7474 3.5161 4.0707 3.9394 3.8871 3.8348 3.5417 1.0024 1.0297 0.9989 1.0135 1.0015 1.0022 1.0019 1.0054 1.0222 1.0292 1.0294 1.0236 0.9965 1.0089 0.9964 0.9967 1.0137 0.9972 1.0048 1.0052 1.0000 0.9897 1.0148 0.9473
dispcorr: -0.021215590 hartree
energy: -964.192557114936
dipole: -26.08900 24.40964 -1.67936 4.75370 -4.43657 0.31712 -16.72528 15.43475 -1.29054
magnitude: 2.14156 au
magnitude: 5.44342 debye
