program: Orca
programVersion: 5.0.2
elementType: O O O C C C C C C C C C C C C C C C C C C C H H H H H H H H H H H H H H H H H H H H H H H H
charge: 0
multiplicity: 1
keywords: wb97x-d3
keywords: def2-TZVPP
keywords: def2/J RIJCOSX
keywords: DEFGRID2
keywords: scfconv7
keywords: smallprint printgap noloewdin
keywords: NOSOSCF
formula: C19H24O3
InChI: InChI=1/C19H24O3/c1-7-8-13-12(4)16(10-15(13)20)22-18(21)17-14(9-11(2)3)19(17,5)6/h1,9,14,16-17H,8,10H2,2-6H3
46 atoms
O  -0.150078 -0.733351 1.134491
O  -1.37285 1.143281 1.096071
O  4.076144 -1.407353 2.85192
C  -3.705746 -0.621806 0.085269
C  -2.900635 -0.355574 -1.145206
C  -2.217479 -0.883346 0.125881
C  -4.339831 0.496938 0.875316
C  -4.561852 -1.868347 0.062225
C  -2.634114 0.995756 -1.671847
C  -1.2490 -0.024273 0.833837
C  -2.166351 1.278372 -2.891171
C  0.938789 -0.072854 1.77589
C  -1.97131 2.701426 -3.322495
C  -1.795616 0.26162 -3.928875
C  1.67774 -1.047873 2.683294
C  1.969435 0.379506 0.766966
C  3.192251 -0.065674 1.081778
C  3.135506 -0.913286 2.285667
C  1.589073 1.243482 -0.379092
C  4.488985 0.208855 0.379731
C  4.520642 -0.308368 -0.981928
C  4.542357 -0.727337 -2.106095
H  -2.983113 -1.124907 -1.904709
H  -1.919845 -1.924559 0.083466
H  -4.51178 0.176845 1.9043
H  -3.74744 1.404612 0.915312
H  -5.310586 0.741835 0.4411
H  -4.732123 -2.245239 1.072159
H  -5.534979 -1.654288 -0.382974
H  -4.103942 -2.67098 -0.517586
H  -2.847023 1.829753 -1.015049
H  0.565961 0.793164 2.329511
H  1.352754 -2.074166 2.500703
H  1.540577 -0.848114 3.745994
H  -0.928011 2.892454 -3.586347
H  -2.563326 2.927243 -4.213191
H  -2.254429 3.408612 -2.544233
H  -2.434374 0.357138 -4.810549
H  -0.771166 0.42391 -4.272176
H  -1.860341 -0.767029 -3.58199
H  1.025582 2.113008 -0.038651
H  0.937413 0.703321 -1.069655
H  2.455809 1.578663 -0.944439
H  4.687261 1.284657 0.360651
H  5.300971 -0.240841 0.95665
H  4.562615 -1.109067 -3.097908
totalener: -964.14749594 hartree
nucrepener: 1788.65867069 hartree
electener: -2752.80616663 hartree
oneelecener: -4861.95247929 hartree
twoeener: 2109.14631266 hartree
kineticenergy: 959.82079477 hartree
xcener: -94.699614121953 hartree
chargesum: 0.0000000
charge: -0.276533 -0.394896 -0.330293 0.104131 0.004894 -0.061463 -0.267145 -0.240292 -0.204196 0.317984 -0.052549 0.215943 -0.206114 -0.248489 -0.132693 -0.043966 -0.058102 0.218303 -0.238996 -0.160501 -0.418190 0.095550 0.082946 0.081501 0.086095 0.104056 0.089331 0.090329 0.091055 0.070744 0.099260 0.097131 0.091063 0.087130 0.081291 0.086593 0.080922 0.095405 0.084225 0.081630 0.119740 0.100501 0.093948 0.119435 0.119138 0.244142
qa: -0.2765 -0.3949 -0.3303 0.1041 0.0049 -0.0615 -0.2671 -0.2403 -0.2042 0.3180 -0.0525 0.2159 -0.2061 -0.2485 -0.1327 -0.0440 -0.0581 0.2183 -0.2390 -0.1605 -0.4182 0.0955 0.0829 0.0815 0.0861 0.1041 0.0893 0.0903 0.0911 0.0707 0.0993 0.0971 0.0911 0.0871 0.0813 0.0866 0.0809 0.0954 0.0842 0.0816 0.1197 0.1005 0.0939 0.1194 0.1191 0.2441
va: 2.1212 2.0875 2.1731 3.7697 3.8002 3.8422 3.9091 3.9003 3.9049 4.1819 3.7987 3.7949 3.9380 3.9472 3.8727 3.7120 3.4864 4.1130 3.9528 3.9136 3.8676 3.5704 1.0088 1.0311 1.0026 1.0226 0.9999 1.0053 1.0042 1.0076 1.0213 1.0275 1.0317 1.0280 0.9992 0.9981 1.0124 0.9986 0.9998 1.0121 1.0086 1.0027 1.0062 0.9850 1.0198 0.9736
dispcorr: -0.022170943 hartree
energy: -964.169666887224
dipole: -22.45137 21.24011 -1.21126 5.72699 -5.49926 0.22773 -16.33631 15.37966 -0.95666
magnitude: 1.56020 au
magnitude: 3.96570 debye
