program: Orca
programVersion: 5.0.2
elementType: O O O C C C C C C C C C C C C C C C C C C C H H H H H H H H H H H H H H H H H H H H H H H H
charge: 0
multiplicity: 1
keywords: wb97x-d3
keywords: def2-TZVPP
keywords: def2/J RIJCOSX
keywords: DEFGRID2
keywords: scfconv7
keywords: smallprint printgap noloewdin
keywords: NOSOSCF
formula: C19H24O3
InChI: InChI=1/C19H24O3/c1-7-8-13-12(4)16(10-15(13)20)22-18(21)17-14(9-11(2)3)19(17,5)6/h1,9,14,16-17H,8,10H2,2-6H3
46 atoms
O  -0.666503 0.173404 0.912543
O  -1.56394 -1.188621 2.43313
O  3.180693 -1.951482 -0.202419
C  -3.482594 0.788238 -0.061556
C  -2.95413 -0.357004 -0.858894
C  -2.93822 -0.419791 0.67281
C  -2.779826 2.123633 -0.044348
C  -4.98638 0.933876 0.009165
C  -1.715034 -0.26597 -1.66981
C  -1.680937 -0.515133 1.443507
C  -1.027385 -1.304932 -2.144596
C  0.632551 -0.051297 1.45298
C  0.197484 -1.105259 -2.98399
C  -1.393026 -2.732439 -1.873906
C  1.203471 -1.425236 1.111032
C  1.547281 0.935649 0.774113
C  2.55319 0.327873 0.135577
C  2.433333 -1.135341 0.273516
C  1.272186 2.393261 0.855737
C  3.669735 0.948109 -0.651404
C  4.513723 1.831105 0.14264
C  5.204428 2.561349 0.798323
H  -3.715828 -1.003721 -1.286023
H  -3.694377 -1.056803 1.116869
H  -1.701974 2.055052 -0.14702
H  -3.153583 2.742586 -0.862262
H  -2.989202 2.651623 0.887404
H  -5.288032 1.444356 0.925368
H  -5.35547 1.517475 -0.836146
H  -5.491869 -0.032299 -0.012481
H  -1.360581 0.73011 -1.912916
H  0.614874 0.123191 2.53358
H  0.50381 -2.035104 0.537089
H  1.471488 -2.002239 1.996207
H  0.09149 -1.585261 -3.960195
H  0.409519 -0.049918 -3.152037
H  1.07525 -1.55487 -2.512156
H  -1.679021 -3.244133 -2.796557
H  -0.536353 -3.281803 -1.474793
H  -2.212203 -2.837374 -1.16503
H  2.155078 2.989834 0.63646
H  0.908596 2.669563 1.84616
H  0.490581 2.672973 0.146163
H  4.282942 0.148169 -1.074095
H  3.265363 1.505226 -1.501793
H  5.825347 3.199806 1.378816
totalener: -964.14197326 hartree
nucrepener: 1870.97198990 hartree
electener: -2835.11396316 hartree
oneelecener: -5026.34448909 hartree
twoeener: 2191.23052593 hartree
kineticenergy: 959.83489954 hartree
xcener: -94.701610938469 hartree
chargesum: -0.0000000
charge: -0.266383 -0.355562 -0.332180 0.138391 -0.045316 -0.117571 -0.252714 -0.248492 -0.144522 0.316245 -0.066298 0.207675 -0.217960 -0.253680 -0.128019 -0.042073 -0.044879 0.199631 -0.276502 -0.155687 -0.427321 0.112747 0.095867 0.087972 0.044281 0.095851 0.096789 0.093469 0.088379 0.073393 0.084593 0.100202 0.085150 0.104240 0.098115 0.075174 0.086819 0.103623 0.087721 0.089563 0.109314 0.100534 0.116399 0.119389 0.118619 0.245013
qa: -0.2664 -0.3556 -0.3322 0.1384 -0.0453 -0.1176 -0.2527 -0.2485 -0.1445 0.3162 -0.0663 0.2077 -0.2180 -0.2537 -0.1280 -0.0421 -0.0449 0.1996 -0.2765 -0.1557 -0.4273 0.1127 0.0959 0.0880 0.0443 0.0959 0.0968 0.0935 0.0884 0.0734 0.0846 0.1002 0.0851 0.1042 0.0981 0.0752 0.0868 0.1036 0.0877 0.0896 0.1093 0.1005 0.1164 0.1194 0.1186 0.2450
va: 2.0766 2.1537 2.1588 3.7515 3.8080 3.8536 3.9104 3.9124 3.8309 4.2388 3.7582 3.7675 3.9340 3.9424 3.8810 3.6889 3.4733 4.0632 3.9482 3.9056 3.9005 3.5494 1.0052 1.0276 1.0235 1.0021 1.0049 1.0037 1.0040 1.0080 1.0097 1.0163 1.0309 1.0263 1.0016 1.0088 1.0050 1.0002 1.0003 1.0058 1.0134 1.0044 0.9904 1.0195 0.9864 0.9730
dispcorr: -0.026421700 hartree
energy: -964.168394955667
dipole: -15.24330 14.29099 -0.95232 5.30932 -4.00410 1.30522 -10.58707 10.10566 -0.48140
magnitude: 1.68590 au
magnitude: 4.28522 debye
