program: Orca
programVersion: 5.0.2
elementType: O O O C C C C C C C C C C C C C C C C C C C H H H H H H H H H H H H H H H H H H H H H H H H
charge: 0
multiplicity: 1
keywords: wb97x-d3
keywords: def2-TZVPP
keywords: def2/J RIJCOSX
keywords: DEFGRID2
keywords: scfconv7
keywords: smallprint printgap noloewdin
keywords: NOSOSCF
formula: C19H24O3
InChI: InChI=1/C19H24O3/c1-7-8-13-12(4)16(10-15(13)20)22-18(21)17-14(9-11(2)3)19(17,5)6/h1,9,14,16-17H,8,10H2,2-6H3
46 atoms
O  -0.014145 -0.716664 1.118047
O  -1.276033 1.129797 1.012179
O  4.12378 -1.277525 3.084453
C  -3.537069 -0.73948 0.002958
C  -2.753221 -0.455333 -1.240712
C  -2.035636 -0.926473 0.027859
C  -4.213039 0.378662 0.757091
C  -4.334704 -2.023236 0.023086
C  -2.574172 0.896344 -1.801449
C  -1.11383 -0.036376 0.761061
C  -2.709216 1.190117 -3.096775
C  1.020439 -0.030169 1.820542
C  -2.508176 2.588741 -3.595436
C  -3.064176 0.164825 -4.143235
C  1.729389 -0.98589 2.771603
C  2.096233 0.448132 0.873155
C  3.309685 0.038355 1.262817
C  3.204544 -0.809729 2.46299
C  1.762074 1.297328 -0.298018
C  4.638298 0.34842 0.639441
C  4.761197 -0.162482 -0.719488
C  4.85092 -0.576981 -1.841881
H  -2.800318 -1.240753 -1.987964
H  -1.694998 -1.954591 -0.005929
H  -4.34045 0.107703 1.806649
H  -3.675761 1.320248 0.724217
H  -5.206259 0.544401 0.336374
H  -3.841581 -2.822958 -0.531323
H  -4.485365 -2.373805 1.045772
H  -5.318258 -1.868873 -0.424221
H  -2.322579 1.696547 -1.117224
H  0.594923 0.826229 2.35059
H  1.444321 -2.020628 2.570609
H  1.522315 -0.790839 3.823866
H  -1.717357 2.626873 -4.349234
H  -3.413503 2.968424 -4.076172
H  -2.24016 3.275575 -2.793685
H  -2.27226 -0.576548 -4.271786
H  -3.977962 -0.377083 -3.895356
H  -3.222015 0.631123 -5.11534
H  1.171192 0.735233 -1.024659
H  2.651726 1.654719 -0.811531
H  1.155952 2.152676 0.003086
H  4.809555 1.429013 0.634517
H  5.426106 -0.082347 1.26244
H  4.935817 -0.953022 -2.832419
totalener: -964.14671086 hartree
nucrepener: 1770.26615427 hartree
electener: -2734.41286512 hartree
oneelecener: -4825.17736951 hartree
twoeener: 2090.76450439 hartree
kineticenergy: 959.81488772 hartree
xcener: -94.698164557620 hartree
chargesum: -0.0000000
charge: -0.277027 -0.399589 -0.330384 0.099737 0.052859 -0.101773 -0.254372 -0.242104 -0.285862 0.332485 0.018282 0.219580 -0.218429 -0.295905 -0.131975 -0.050784 -0.056862 0.217441 -0.235488 -0.159669 -0.419638 0.097035 0.089099 0.083096 0.087263 0.103594 0.085540 0.071620 0.089904 0.089074 0.110883 0.096058 0.090985 0.087135 0.089699 0.088774 0.077164 0.097394 0.099081 0.087543 0.102705 0.094381 0.118380 0.119158 0.119390 0.244519
qa: -0.2770 -0.3996 -0.3304 0.0997 0.0529 -0.1018 -0.2544 -0.2421 -0.2859 0.3325 0.0183 0.2196 -0.2184 -0.2959 -0.1320 -0.0508 -0.0569 0.2174 -0.2355 -0.1597 -0.4196 0.0970 0.0891 0.0831 0.0873 0.1036 0.0855 0.0716 0.0899 0.0891 0.1109 0.0961 0.0910 0.0871 0.0897 0.0888 0.0772 0.0974 0.0991 0.0875 0.1027 0.0944 0.1184 0.1192 0.1194 0.2445
va: 2.1264 2.0833 2.1728 3.7343 3.7769 3.9147 3.9208 3.9102 3.9422 4.1669 3.6817 3.7878 3.9408 3.9516 3.8733 3.7182 3.4878 4.1124 3.9493 3.9149 3.8665 3.5695 1.0031 1.0303 1.0025 1.0187 1.0022 1.0079 1.0050 1.0042 1.0238 1.0283 1.0317 1.0279 0.9939 0.9945 1.0137 0.9955 0.9955 1.0079 1.0032 1.0064 1.0087 0.9851 1.0199 0.9734
dispcorr: -0.021613224 hartree
energy: -964.168324079259
dipole: -25.16529 23.92196 -1.24333 4.71272 -4.55426 0.15847 -17.48663 16.48480 -1.00183
magnitude: 1.60457 au
magnitude: 4.07848 debye
