program: Orca
programVersion: 5.0.2
elementType: O O O C C C C C C C C C C C C C C C C C C C H H H H H H H H H H H H H H H H H H H H H H H H
charge: 0
multiplicity: 1
keywords: wb97x-d3
keywords: def2-TZVPP
keywords: def2/J RIJCOSX
keywords: DEFGRID2
keywords: scfconv7
keywords: smallprint printgap noloewdin
keywords: NOSOSCF
formula: C19H24O3
InChI: InChI=1/C19H24O3/c1-7-8-13-12(4)16(10-15(13)20)22-18(21)17-14(9-11(2)3)19(17,5)6/h1,9,14,16-17H,8,10H2,2-6H3
46 atoms
O  -0.608544 0.065817 1.178149
O  -1.770506 -1.50047 2.259997
O  3.103376 -1.949016 -0.190211
C  -3.155921 0.993769 -0.15242
C  -2.603968 -0.105799 -0.996927
C  -2.832848 -0.331211 0.504606
C  -2.365311 2.250246 0.122041
C  -4.636649 1.273463 -0.286636
C  -1.253671 -0.053884 -1.609671
C  -1.714171 -0.646255 1.415067
C  -0.630543 -1.083548 -2.186031
C  0.595763 -0.356574 1.814547
C  0.699631 -0.911515 -2.855354
C  -1.183284 -2.476138 -2.21564
C  1.14958 -1.652029 1.22717
C  1.618027 0.697903 1.46635
C  2.593816 0.209225 0.694262
C  2.39112 -1.233063 0.466583
C  1.453355 2.092816 1.946361
C  3.739499 0.949306 0.071665
C  3.285108 1.925045 -0.910866
C  2.887478 2.726365 -1.710966
H  -3.341465 -0.626476 -1.601328
H  -3.69504 -0.940211 0.749949
H  -2.643174 2.670343 1.090199
H  -1.289884 2.106605 0.118522
H  -2.600065 2.997758 -0.638039
H  -5.033783 1.727627 0.622824
H  -4.822516 1.961985 -1.112855
H  -5.209454 0.365686 -0.479916
H  -0.754853 0.909022 -1.624542
H  0.437784 -0.424803 2.894945
H  0.44841 -2.156388 0.561899
H  1.416734 -2.370122 2.004063
H  1.086131 0.101806 -2.74957
H  1.443473 -1.596633 -2.443333
H  0.629541 -1.136577 -3.922929
H  -2.113807 -2.581608 -1.661123
H  -1.360796 -2.805543 -3.242591
H  -0.464085 -3.180696 -1.789801
H  0.515171 2.519113 1.587333
H  2.261141 2.743513 1.618754
H  1.410724 2.116362 3.037884
H  4.33401 1.455343 0.837662
H  4.404964 0.229212 -0.41081
H  2.546068 3.434188 -2.426949
totalener: -964.14254977 hartree
nucrepener: 1898.34455974 hartree
electener: -2862.48710951 hartree
oneelecener: -5081.37784524 hartree
twoeener: 2218.89073572 hartree
kineticenergy: 959.83387210 hartree
xcener: -94.701116080182 hartree
chargesum: 0.0000000
charge: -0.269304 -0.356778 -0.335591 0.148309 -0.051796 -0.103305 -0.272038 -0.248338 -0.150349 0.305032 -0.076199 0.212045 -0.209290 -0.248232 -0.121119 -0.027549 -0.058670 0.196441 -0.235712 -0.133706 -0.410260 0.065283 0.092607 0.085631 0.099214 0.064479 0.093182 0.092094 0.088515 0.073171 0.089439 0.094880 0.085913 0.099682 0.073031 0.091431 0.097628 0.086056 0.099677 0.088582 0.107614 0.090846 0.103345 0.120037 0.119514 0.244557
qa: -0.2693 -0.3568 -0.3356 0.1483 -0.0518 -0.1033 -0.2720 -0.2483 -0.1503 0.3050 -0.0762 0.2120 -0.2093 -0.2482 -0.1211 -0.0275 -0.0587 0.1964 -0.2357 -0.1337 -0.4103 0.0653 0.0926 0.0856 0.0992 0.0645 0.0932 0.0921 0.0885 0.0732 0.0894 0.0949 0.0859 0.0997 0.0730 0.0914 0.0976 0.0861 0.0997 0.0886 0.1076 0.0908 0.1033 0.1200 0.1195 0.2446
va: 2.0750 2.1512 2.1508 3.7292 3.8099 3.8526 3.9125 3.9105 3.8218 4.2519 3.7531 3.7995 3.9281 3.9409 3.8872 3.7008 3.4979 4.0608 3.9556 3.8896 3.8570 3.6135 1.0050 1.0283 1.0011 1.0165 1.0034 1.0037 1.0042 1.0082 1.0097 1.0177 1.0313 1.0234 1.0141 1.0087 1.0004 1.0070 1.0005 1.0013 1.0007 1.0075 1.0013 0.9866 1.0196 0.9744
dispcorr: -0.027318118 hartree
energy: -964.169867889167
dipole: -11.58315 11.09996 -0.48320 6.65094 -5.32730 1.32364 -8.71652 8.80876 0.09223
magnitude: 1.41209 au
magnitude: 3.58925 debye
