program: Orca
programVersion: 5.0.2
elementType: O O O C C C C C C C C C C C C C C C C C C C H H H H H H H H H H H H H H H H H H H H H H H H
charge: 0
multiplicity: 1
keywords: wb97x-d3
keywords: def2-TZVPP
keywords: def2/J RIJCOSX
keywords: DEFGRID2
keywords: scfconv7
keywords: smallprint printgap noloewdin
keywords: NOSOSCF
formula: C19H24O3
InChI: InChI=1/C19H24O3/c1-7-8-13-12(4)16(10-15(13)20)22-18(21)17-14(9-11(2)3)19(17,5)6/h1,9,14,16-17H,8,10H2,2-6H3
46 atoms
O  0.132959 -0.886167 -0.290433
O  -0.387408 -2.784457 0.774678
O  3.89339 0.542292 -2.43749
C  -2.230606 0.218226 1.411553
C  -2.549947 0.147947 -0.052948
C  -2.016428 -1.081784 0.651899
C  -1.059055 1.060406 1.853666
C  -3.354668 0.206958 2.419123
C  -3.937528 0.129075 -0.561387
C  -0.690075 -1.673984 0.396193
C  -4.455141 0.944464 -1.486211
C  1.458852 -1.330356 -0.600499
C  -5.885387 0.807634 -1.91585
C  -3.710911 2.052508 -2.166256
C  1.893407 -0.736747 -1.933085
C  2.44509 -0.796888 0.409605
C  3.410528 -0.076341 -0.179934
C  3.176025 -0.005454 -1.624302
C  2.309114 -1.098305 1.853434
C  4.577074 0.592422 0.483154
C  4.162971 1.740435 1.281358
C  3.804409 2.66918 1.95476
H  -1.830662 0.659612 -0.682249
H  -2.747971 -1.848318 0.884883
H  -0.582309 0.635961 2.73981
H  -1.411939 2.058228 2.121169
H  -0.298338 1.183673 1.085967
H  -2.989088 -0.120428 3.394061
H  -4.172003 -0.454314 2.135264
H  -3.765892 1.210964 2.541286
H  -4.59076 -0.626813 -0.134303
H  1.491551 -2.421388 -0.616211
H  1.156365 -0.032258 -2.324173
H  2.057729 -1.494379 -2.699613
H  -6.395513 -0.006216 -1.400729
H  -6.441132 1.729549 -1.725589
H  -5.955395 0.623567 -2.991124
H  -2.675188 2.151314 -1.848392
H  -3.715304 1.912699 -3.250095
H  -4.204266 3.009875 -1.980625
H  3.181349 -0.785018 2.423652
H  2.157318 -2.166777 2.011602
H  1.438763 -0.588023 2.273952
H  5.105776 -0.11803 1.124179
H  5.295767 0.916261 -0.273003
H  3.505759 3.503979 2.548257
elementType: O C H
totalener: -964.16182084 hartree
nucrepener: 1786.71751116 hartree
electener: -2750.87933200 hartree
oneelecener: -4857.77181376 hartree
twoeener: 2106.89248176 hartree
cpcmener: -0.03971727 hartree
kineticenergy: 959.76589166 hartree
xcener: -94.698235746277 hartree
chargesum: 0.0000000
charge: -0.278015 -0.495113 -0.479630 0.123253 0.067644 -0.135551 -0.305399 -0.271868 -0.304456 0.429196 -0.046087 0.209497 -0.221830 -0.254177 -0.133969 -0.015735 -0.094174 0.312552 -0.260775 -0.092961 -0.458776 0.033513 0.103050 0.091087 0.104356 0.104165 0.091219 0.098507 0.089231 0.096667 0.122810 0.113081 0.104839 0.104938 0.088745 0.093480 0.094106 0.088868 0.096706 0.096912 0.103798 0.121438 0.127770 0.135602 0.109907 0.291581
qa: -0.2780 -0.4951 -0.4796 0.1233 0.0676 -0.1356 -0.3054 -0.2719 -0.3045 0.4292 -0.0461 0.2095 -0.2218 -0.2542 -0.1340 -0.0157 -0.0942 0.3126 -0.2608 -0.0930 -0.4588 0.0335 0.1030 0.0911 0.1044 0.1042 0.0912 0.0985 0.0892 0.0967 0.1228 0.1131 0.1048 0.1049 0.0887 0.0935 0.0941 0.0889 0.0967 0.0969 0.1038 0.1214 0.1278 0.1356 0.1099 0.2916
va: 2.1178 1.9979 2.0205 3.6649 3.7322 3.8939 3.9076 3.9078 3.8506 4.1443 3.7541 3.7674 3.9219 3.9437 3.9256 3.6967 3.5233 4.0299 3.9340 3.8809 3.8225 3.5432 1.0184 1.0346 0.9949 1.0031 1.0128 1.0017 1.0057 1.0024 1.0093 1.0287 1.0260 1.0219 1.0087 0.9963 0.9960 1.0106 0.9967 0.9972 1.0031 1.0086 0.9893 0.9890 1.0207 0.9443
dispcorr: -0.022662296 hartree
energy: -964.184483138623
dipole: -24.68278 23.38691 -1.29588 8.01752 -7.82771 0.18981 4.95982 -3.91955 1.04027
magnitude: 1.67257 au
magnitude: 4.25133 debye
