program: Orca
programVersion: 5.0.2
elementType: O O O C C C C C C C C C C C C C C C C C C C H H H H H H H H H H H H H H H H H H H H H H H H
charge: 0
multiplicity: 1
keywords: wb97x-d3
keywords: def2-TZVPP
keywords: def2/J RIJCOSX
keywords: DEFGRID2
keywords: scfconv7
keywords: smallprint printgap noloewdin
keywords: NOSOSCF
formula: C19H24O3
InChI: InChI=1/C19H24O3/c1-7-8-13-12(4)16(10-15(13)20)22-18(21)17-14(9-11(2)3)19(17,5)6/h1,9,14,16-17H,8,10H2,2-6H3
46 atoms
O  0.098462 -1.354111 -0.693559
O  0.195745 0.691267 0.208503
O  3.86581 1.063039 -2.219898
C  -2.419696 -0.345954 1.650656
C  -2.769295 0.614817 0.568206
C  -1.852537 -0.548498 0.249348
C  -1.524884 0.107888 2.777395
C  -3.43786 -1.374595 2.078335
C  -4.124557 0.667572 -0.04054
C  -0.436837 -0.305224 -0.059088
C  -4.370207 0.88197 -1.335651
C  1.477013 -1.328013 -1.060607
C  -5.768744 0.930959 -1.869714
C  -3.29333 1.078819 -2.357839
C  1.871133 -0.317268 -2.132755
C  2.413877 -1.069182 0.08947
C  3.381146 -0.205126 -0.253219
C  3.149279 0.293412 -1.608577
C  2.249614 -1.762724 1.388567
C  4.528293 0.244432 0.600675
C  4.074281 1.00206 1.761214
C  3.668656 1.608337 2.716899
H  -2.253252 1.570216 0.634141
H  -2.295211 -1.370213 -0.301823
H  -0.860135 0.921693 2.496699
H  -0.914641 -0.716652 3.151477
H  -2.138221 0.462926 3.607801
H  -4.048211 -1.729684 1.248098
H  -4.109181 -0.959549 2.832699
H  -2.942555 -2.241168 2.519465
H  -4.967754 0.540658 0.633006
H  1.652722 -2.344932 -1.41797
H  1.125266 0.46609 -2.278247
H  2.037974 -0.781748 -3.104952
H  -6.512811 0.752716 -1.093776
H  -5.980297 1.901162 -2.326191
H  -5.911812 0.184127 -2.654864
H  -3.295146 0.25984 -3.08206
H  -3.471416 1.992992 -2.929298
H  -2.29521 1.14437 -1.928976
H  3.203281 -1.898052 1.897355
H  1.778286 -2.737313 1.265879
H  1.610391 -1.174529 2.052946
H  5.105218 -0.618813 0.944025
H  5.214988 0.856127 0.011701
H  3.312735 2.152211 3.562961
elementType: O C H
totalener: -964.15979269 hartree
nucrepener: 1812.90678600 hartree
electener: -2777.06657869 hartree
oneelecener: -4911.21898085 hartree
twoeener: 2134.15240216 hartree
cpcmener: -0.04177693 hartree
kineticenergy: 959.77712996 hartree
xcener: -94.701547012694 hartree
chargesum: -0.0000000
charge: -0.302359 -0.493808 -0.487716 0.155010 -0.010234 -0.121651 -0.292055 -0.287052 -0.306415 0.408634 -0.013501 0.285164 -0.228560 -0.239963 -0.151504 0.009220 -0.131572 0.301451 -0.283022 -0.098357 -0.443786 0.016535 0.105327 0.094048 0.093459 0.098751 0.101490 0.094303 0.099601 0.098206 0.124690 0.122757 0.115980 0.110883 0.090254 0.096870 0.094479 0.101415 0.101639 0.079551 0.119931 0.120017 0.116587 0.136218 0.107494 0.291591
qa: -0.3024 -0.4938 -0.4877 0.1550 -0.0102 -0.1217 -0.2921 -0.2871 -0.3064 0.4086 -0.0135 0.2852 -0.2286 -0.2400 -0.1515 0.0092 -0.1316 0.3015 -0.2830 -0.0984 -0.4438 0.0165 0.1053 0.0940 0.0935 0.0988 0.1015 0.0943 0.0996 0.0982 0.1247 0.1228 0.1160 0.1109 0.0903 0.0969 0.0945 0.1014 0.1016 0.0796 0.1199 0.1200 0.1166 0.1362 0.1075 0.2916
va: 2.1246 2.0111 2.0121 3.6850 3.8103 3.8278 3.8962 3.9068 3.8918 4.1278 3.7050 3.7782 3.9303 3.9357 3.8752 3.6434 3.5185 4.0361 3.9398 3.8896 3.8031 3.5605 1.0247 1.0324 1.0164 0.9988 1.0028 1.0019 0.9999 1.0025 1.0033 0.9918 1.0239 1.0226 1.0057 0.9963 0.9963 0.9982 1.0002 1.0145 0.9951 1.0060 0.9930 0.9891 1.0220 0.9444
dispcorr: -0.023624584 hartree
energy: -964.183417272617
dipole: -25.31222 23.50007 -1.81215 -3.53601 0.98164 -2.55437 5.30784 -4.57828 0.72956
magnitude: 3.21574 au
magnitude: 8.17376 debye
