program: Orca
programVersion: 5.0.2
elementType: O O O C C C C C C C C C C C C C C C C C C C H H H H H H H H H H H H H H H H H H H H H H H H
charge: 0
multiplicity: 1
keywords: wb97x-d3
keywords: def2-TZVPP
keywords: def2/J RIJCOSX
keywords: DEFGRID2
keywords: scfconv7
keywords: smallprint printgap noloewdin
keywords: NOSOSCF
formula: C19H24O3
InChI: InChI=1/C19H24O3/c1-7-8-13-12(4)16(10-15(13)20)22-18(21)17-14(9-11(2)3)19(17,5)6/h1,9,14,16-17H,8,10H2,2-6H3
46 atoms
O  0.536989 0.065472 0.269081
O  -0.756171 -1.137339 1.636268
O  4.556978 -2.213883 0.221366
C  -2.706569 -1.040679 -0.828973
C  -3.15325 -0.045768 0.196045
C  -1.713559 -0.032778 -0.263393
C  -2.639747 -2.496996 -0.44316
C  -3.097121 -0.825663 -2.270357
C  -4.030528 1.100834 -0.14573
C  -0.637801 -0.439063 0.654763
C  -5.337383 1.171872 0.122981
C  1.688096 -0.249465 1.056381
C  -6.144257 2.37537 -0.257986
C  -6.109049 0.083093 0.802771
C  2.264452 -1.631755 0.774014
C  2.77381 0.718224 0.672164
C  3.909407 0.083211 0.348139
C  3.70791 -1.366775 0.415586
C  2.530692 2.178095 0.715845
C  5.221592 0.704002 -0.026915
C  5.17263 1.357515 -1.329036
C  5.119886 1.900904 -2.399809
H  -3.301718 -0.470514 1.184433
H  -1.4390 0.759755 -0.95076
H  -1.838717 -3.011727 -0.977292
H  -3.578217 -2.984583 -0.713706
H  -2.492123 -2.653198 0.622473
H  -2.423445 -1.369271 -2.934977
H  -3.07285 0.22413 -2.560099
H  -4.108445 -1.195982 -2.449358
H  -3.564958 1.93566 -0.661685
H  1.453562 -0.117916 2.116462
H  1.768847 -2.110391 -0.073937
H  2.192218 -2.31181 1.622352
H  -6.61356 2.82801 0.619077
H  -5.539217 3.137829 -0.747886
H  -6.957187 2.101526 -0.935176
H  -6.588593 0.455562 1.711208
H  -6.9147 -0.271868 0.155105
H  -5.500642 -0.778119 1.073035
H  1.987145 2.449706 1.6220
H  1.912158 2.489214 -0.128958
H  3.454489 2.752225 0.67843
H  5.518371 1.43662 0.72803
H  6.002608 -0.059066 -0.036018
H  5.078537 2.3853 -3.348975
elementType: O C H
totalener: -964.16412139 hartree
nucrepener: 1734.66321325 hartree
electener: -2698.82733464 hartree
oneelecener: -4754.10010448 hartree
twoeener: 2055.27276984 hartree
cpcmener: -0.03919338 hartree
kineticenergy: 959.77448909 hartree
xcener: -94.697574855347 hartree
chargesum: -0.0000000
charge: -0.297224 -0.498971 -0.479378 0.150368 -0.007638 -0.116867 -0.297827 -0.266303 -0.271506 0.417239 -0.032842 0.237401 -0.229641 -0.251343 -0.138217 -0.021478 -0.083672 0.316599 -0.268823 -0.095726 -0.463493 0.041458 0.098352 0.093442 0.102073 0.097837 0.092966 0.099220 0.091474 0.096586 0.124256 0.108466 0.107774 0.105915 0.094877 0.090567 0.094392 0.098587 0.097179 0.088090 0.119373 0.116155 0.102377 0.135800 0.109927 0.292198
qa: -0.2972 -0.4990 -0.4794 0.1504 -0.0076 -0.1169 -0.2978 -0.2663 -0.2715 0.4172 -0.0328 0.2374 -0.2296 -0.2513 -0.1382 -0.0215 -0.0837 0.3166 -0.2688 -0.0957 -0.4635 0.0415 0.0984 0.0934 0.1021 0.0978 0.0930 0.0992 0.0915 0.0966 0.1243 0.1085 0.1078 0.1059 0.0949 0.0906 0.0944 0.0986 0.0972 0.0881 0.1194 0.1162 0.1024 0.1358 0.1099 0.2922
va: 2.1328 2.0047 2.0221 3.6631 3.7852 3.9217 3.9020 3.9044 3.8708 4.1295 3.7029 3.7798 3.9258 3.9428 3.9040 3.7300 3.5361 4.0310 3.9515 3.8730 3.8255 3.5302 1.0240 1.0353 0.9992 1.0006 1.0181 1.0028 1.0025 1.0026 1.0065 1.0168 1.0226 1.0237 0.9956 1.0074 0.9961 0.9982 0.9972 1.0082 1.0007 0.9997 1.0009 0.9880 1.0211 0.9436
dispcorr: -0.021138511 hartree
energy: -964.185259898325
dipole: -32.09050 30.37285 -1.71765 5.55044 -3.51141 2.03902 -4.31639 4.13544 -0.18095
magnitude: 2.67221 au
magnitude: 6.79222 debye
