program: Orca
programVersion: 5.0.2
elementType: O O O C C C C C C C C C C C C C C C C C C C H H H H H H H H H H H H H H H H H H H H H H H H
charge: 0
multiplicity: 1
keywords: wb97x-d3
keywords: def2-TZVPP
keywords: def2/J RIJCOSX
keywords: DEFGRID2
keywords: scfconv7
keywords: smallprint printgap noloewdin
keywords: NOSOSCF
formula: C19H24O3
InChI: InChI=1/C19H24O3/c1-7-8-13-12(4)16(10-15(13)20)22-18(21)17-14(9-11(2)3)19(17,5)6/h1,9,14,16-17H,8,10H2,2-6H3
46 atoms
O  0.475143 -1.132563 -0.137054
O  -0.691356 -1.164719 1.776864
O  4.98343 -1.365528 -0.941644
C  -3.138944 -1.665844 -0.108467
C  -3.051204 -0.20504 0.191647
C  -1.819226 -0.946539 -0.324259
C  -3.322103 -2.625012 1.042504
C  -3.821633 -2.139079 -1.370424
C  -3.679192 0.836847 -0.6421
C  -0.66054 -1.097423 0.568661
C  -3.979386 2.083253 -0.259639
C  1.732036 -1.21732 0.542264
C  -4.647603 3.034153 -1.207108
C  -3.70141 2.657955 1.096038
C  2.726392 -1.996777 -0.306527
C  2.338009 0.156958 0.693281
C  3.570928 0.210425 0.167917
C  3.917756 -1.079677 -0.43249
C  1.605464 1.25093 1.371638
C  4.503292 1.384194 0.152162
C  4.110563 2.376246 -0.841647
C  3.769716 3.188276 -1.659752
H  -2.998574 0.015701 1.252203
H  -1.563823 -0.773371 -1.36328
H  -2.81913 -3.573855 0.846725
H  -4.385367 -2.838508 1.165796
H  -2.958087 -2.236546 1.990341
H  -3.602489 -1.514949 -2.235684
H  -4.904788 -2.15947 -1.237056
H  -3.499645 -3.153372 -1.612147
H  -3.919443 0.555785 -1.663047
H  1.598747 -1.675563 1.524175
H  2.328596 -2.206286 -1.301943
H  3.012902 -2.950047 0.137551
H  -5.59478 3.39318 -0.795924
H  -4.029818 3.920277 -1.374064
H  -4.852372 2.577481 -2.17521
H  -3.132704 1.999358 1.749306
H  -3.142292 3.592038 1.00216
H  -4.634382 2.91046 1.606955
H  1.24987 0.927746 2.351129
H  0.724009 1.541757 0.794767
H  2.2209 2.138579 1.503376
H  4.534377 1.856706 1.136838
H  5.520515 1.046155 -0.057721
H  3.470598 3.908561 -2.387653
elementType: O C H
totalener: -964.16361406 hartree
nucrepener: 1756.64125340 hartree
electener: -2720.80486746 hartree
oneelecener: -4797.99638224 hartree
twoeener: 2077.19151478 hartree
cpcmener: -0.03838016 hartree
kineticenergy: 959.76142887 hartree
xcener: -94.696916461897 hartree
chargesum: -0.0000000
charge: -0.297563 -0.499335 -0.480849 0.118458 -0.003319 -0.076124 -0.277749 -0.290018 -0.270843 0.403928 -0.032739 0.255167 -0.223506 -0.259254 -0.136978 -0.021326 -0.098745 0.315291 -0.248564 -0.101199 -0.462195 0.041171 0.102204 0.091780 0.099493 0.096715 0.090495 0.092222 0.101617 0.098057 0.119508 0.107357 0.103935 0.103000 0.093418 0.094399 0.089006 0.089514 0.095122 0.099906 0.119500 0.117030 0.103173 0.135478 0.111288 0.292073
qa: -0.2976 -0.4993 -0.4808 0.1185 -0.0033 -0.0761 -0.2777 -0.2900 -0.2708 0.4039 -0.0327 0.2552 -0.2235 -0.2593 -0.1370 -0.0213 -0.0987 0.3153 -0.2486 -0.1012 -0.4622 0.0412 0.1022 0.0918 0.0995 0.0967 0.0905 0.0922 0.1016 0.0981 0.1195 0.1074 0.1039 0.1030 0.0934 0.0944 0.0890 0.0895 0.0951 0.0999 0.1195 0.1170 0.1032 0.1355 0.1113 0.2921
va: 2.1265 2.0000 2.0184 3.7083 3.8158 3.8204 3.8977 3.9175 3.8979 4.1518 3.7448 3.7508 3.9228 3.9399 3.9164 3.7468 3.5357 4.0272 3.9342 3.8782 3.8296 3.5320 1.0206 1.0350 0.9992 0.9998 1.0196 1.0057 0.9998 1.0010 1.0105 1.0296 1.0286 1.0226 0.9951 0.9966 1.0084 1.0114 0.9971 0.9965 1.0066 0.9973 1.0035 0.9886 1.0192 0.9437
dispcorr: -0.021042857 hartree
energy: -964.184656919126
dipole: -29.51992 27.51379 -2.00613 6.85003 -6.15955 0.69048 1.10748 -0.73744 0.37004
magnitude: 2.15366 au
magnitude: 5.47417 debye
